program: Gaussian 09
title: 000225546
version: EM64L-G09RevD.01
frameworkgroup: C1[X(C7H13ClO2)]
method: RPBEPBE
basis: SDD
operation: Freq
keyword: #p
keyword: freq=noraman
keyword: PBEPBE/SDD
title: #p freq=noraman PBEPBE/SDD
converged: YES YES NO NO
title: Mulliken charges:
elementType: Cl O O C C C C C C C H H H H H H H H H H H H H
charge: -0.018473 -0.304912 -0.224881 0.371736 -0.393307 -0.721168 -0.735846 -0.703893 0.362314 -0.703402 0.254548 0.201688 0.215277 0.264359 0.222381 0.207808 0.227799 0.239683 0.222035 0.223222 0.217713 0.288257 0.287060
chargesum: 0.00000
title: Mulliken charges with hydrogens summed into heavy atoms:
elementType: Cl O O C C C C C C C
charge: -0.018473 -0.304912 -0.224881 0.371736 0.062929 -0.019151 -0.060556 -0.040922 0.362314 -0.128085
polarizability: 1.12235330e+02 3.15645203e+00 7.65976802e+01 -5.24110653e+00 -6.17504907e-01 8.16944004e+01
1716.lowfreq: -23.9439 -5.5114 0.0017 0.0022 0.0028 5.5252 11.1776 52.4270 64.8542
frequency: 5.8895 52.0942 64.8174 117.1597 130.3864 183.6026 197.5062 228.9394 240.4369 254.7256 272.3942 329.9423 332.2620 397.7195 441.3120 492.9664 550.7028 644.6426 671.7550 750.8959 778.5922 798.0173 901.1296 913.9411 919.3506 932.9417 992.9184 1007.9189 1061.4926 1070.5350 1112.8562 1146.6942 1171.5136 1213.6505 1243.4528 1278.2108 1300.5515 1354.6694 1378.3077 1393.7998 1396.4341 1421.5034 1449.3489 1465.1699 1468.6211 1471.4179 1480.0257 1487.0659 1496.0556 1662.0443 2987.1541 2988.8859 2991.9510 2997.6452 3058.5460 3059.4151 3082.8503 3083.7853 3087.0205 3095.0466 3104.7619 3112.5196 3135.2035
redmass: 3.7058 2.8667 3.8113 4.8758 2.3901 1.0823 1.6174 1.4703 2.9078 1.6450 4.3009 2.4827 3.1325 2.7629 2.5159 2.8350 3.0734 5.8210 6.6771 2.9463 1.8072 2.2269 3.5708 1.8321 2.2024 1.5782 1.2792 1.5225 1.4664 2.3961 3.4828 1.1087 2.2451 2.5188 1.9688 1.4415 1.6482 1.4544 1.2287 1.2269 1.2104 1.0862 1.0557 1.0602 1.0683 1.0552 1.0472 1.0522 1.0533 10.1446 1.0379 1.0562 1.0404 1.0386 1.0962 1.0570 1.0990 1.0988 1.1004 1.0992 1.0995 1.1001 1.1075
irintensity: 3.1297 0.0335 6.9316 2.1071 0.1403 0.2422 1.0743 0.0112 0.8126 0.1713 5.5161 3.6004 3.8538 0.8450 4.4915 0.3389 5.0593 1.4696 9.9111 21.2801 7.7899 39.1577 31.0294 8.5375 39.5526 5.1036 4.2452 14.1303 19.6454 5.5923 455.4188 0.0379 6.0750 14.5241 12.2383 26.5625 7.5847 9.6995 32.3809 29.4594 13.3906 31.3396 1.8511 2.4158 20.2299 4.8397 10.6377 24.3825 9.7855 137.6121 28.0593 10.9932 22.5081 26.2921 0.4997 8.2807 18.0629 24.6705 40.9811 51.4662 22.6852 13.4319 2.0572
temp: 298.150 k
press: 1.00000 atm
elementType: 17 8 8 6 6 6 6 6 6 6 1 1 1 1 1 1 1 1 1 1 1 1 1
symmnumber: 1
zpe: 495930.9 jmol-1
zpe.correction: 0.188890 hartree
zpe.thermalcorrener: 0.201589 hartree
zpe.thermalcorrenthalpy: 0.202533 hartree
zpe.thermalcorrgfe: 0.147511 hartree
zpe.sumelectzpe: -884.240155 hartree
zpe.sumelectthermal: -884.227457 hartree
zpe.sumelectthermalent: -884.226513 hartree
zpe.sumelectthermalfe: -884.281534 hartree
dipole: -3.6028 -0.4017 2.1846
dipole: 4.2325
quadrupole: -70.4200 -65.8340 -70.3816
quadrupole: 0.0552 5.0102 -0.1096
quadrupole: -1.5414 3.0445 -1.5031 0.0552 5.0102 -0.1096
hfenergy: -884.4290452 hartree
pointgroup: C01 [X(C7H13Cl1O2)]
dipole: 1.454568 -0.2310393 -0.7770067 debye
dipolederiv: -0.4814151 0.0469412 0.0352131 0.0543866 -0.145347 -0.0059096 0.1016316 -0.014122 -0.1411747 -1.8548417 0.2032328 0.1199814 0.2237358 -0.4127794 -0.0349668 0.1628798 -0.0301251 -0.5394344 -0.6669669 0.0367067 -0.0375876 0.0604169 -0.3152511 -0.0134344 0.2215959 -0.0543322 -0.8400349 1.0797826 -0.0778106 -0.0013896 -0.0920231 0.4495504 -0.0068842 0.2332488 -0.012841 0.3154157 -0.0443349 0.0115253 0.0181236 0.0108388 -0.0231615 -0.0367325 -0.0150145 -0.010202 -0.0293833 -0.1187327 -0.0172314 0.0435418 0.0095134 -0.1362141 0.1049525 -0.019912 0.0633338 -0.0732543 -0.0882918 0.013432 0.0621592 0.0108896 0.0028415 -0.0081838 0.0657386 -0.0204796 -0.093841 0.1008768 -0.0171508 -0.0216262 -0.0068788 -0.0729751 0.046601 -0.0320775 0.0126333 0.0456571 1.6909454 -0.1824401 -0.0244709 -0.2299058 0.2388301 0.0463158 -0.2690815 0.0721398 1.0799545 0.4757592 -0.0485744 -0.2103138 -0.059871 0.1681668 0.0241007 -0.4466834 0.0549137 -0.0330191 0.0698857 0.0215157 0.114662 0.0035243 0.0362349 0.0067652 0.0966553 0.0029025 -0.0255044 -0.1358607 0.0479999 -0.1125376 0.0209461 0.0265081 0.0363973 -0.0995874 0.0368314 0.0572043 -0.1252439 0.0576354 -0.0896859 0.047976 0.0818482 0.0162482 -0.0858865 0.0278472 0.0869382 0.0627872 -0.0181579 0.107976 0.0057708 0.1017512 -0.0392825 0.0949793 -0.0024776 -0.006832 0.091981 -0.0744994 -0.0345919 -0.0608939 -0.0848246 -0.0570496 -0.0378186 -0.1132327 0.0118002 -0.1350039 0.0259055 -0.0490458 0.0182266 0.1031129 0.0016541 -0.0933574 0.0108273 0.0479274 0.0938342 -0.0627688 -0.032201 -0.0331155 -0.0887952 -0.1188991 0.0000331 -0.0903384 0.035563 0.1026606 0.0054232 -0.0015526 -0.0048592 -0.0331811 0.1349054 0.0210234 0.1158915 0.0044742 0.0836272 -0.0394161 -0.0201279 -0.054347 -0.1050287 -0.0961278 -0.0356903 -0.1344935 -0.0015581 -0.1049848 0.0606292 -0.0958366 0.0296652 0.0880434 0.0138317 -0.0827389 0.052373 0.028498 -0.0437575 -0.0083858 0.1264175 0.0298858 0.0852172 -0.0032464 0.1321365 0.0431186 -0.0492644 -0.0226415 0.0402999 0.036505 0.0113571 0.0085626 -0.0868993 0.0320083 -0.0668363 0.0644078 -0.0300646 -0.0248116 0.0663879 0.0047615 0.0268909 0.0758443 0.0559174 0.0566682 0.0554602 unknown
polarizability: 112.3309155|-4.9546778|77.0008689|-3.4373085|0.6125447|81.1956262 unknown
InChI: InChI=1S/C7H13ClO2/c1-4-7(2,3)10-6(9)5-8/h4-5H2,1-3H3
charge 0 multiplicity 1
23 atoms
Cl -3.945363 0.363821 -0.246494
O  0.006334 -0.268762 -0.69885
O  -1.27881 0.022538 1.252266
C  1.353579 -0.462901 0.016825
C  1.694232 0.802185 0.847581
C  1.261049 -1.718689 0.905758
C  2.309407 -0.681244 -1.16698
C  1.710532 2.130301 0.062603
C  -1.164727 -0.049908 0.013842
C  -2.281217 0.08329 -1.025433
H  0.977883 0.873356 1.6847
H  2.692671 0.623066 1.295211
H  2.263545 -1.955413 1.306868
H  0.572297 -1.561925 1.750979
H  0.915527 -2.586672 0.316839
H  3.34637 -0.777395 -0.797906
H  2.044854 -1.602992 -1.713041
H  2.265552 0.161887 -1.875682
H  1.902466 2.97412 0.749169
H  0.739649 2.315132 -0.431063
H  2.495211 2.146992 -0.714807
H  -2.348825 -0.835976 -1.62588
H  -2.079914 0.937889 -1.688606
