program: Gaussian 09
title: 000225523
version: EM64L-G09RevD.01
frameworkgroup: C1[X(C7H5Cl2NO2)]
method: RPBEPBE
basis: SDD
operation: Freq
keyword: #p
keyword: freq=noraman
keyword: PBEPBE/SDD
title: #p freq=noraman PBEPBE/SDD
converged: YES YES NO NO
title: Mulliken charges:
elementType: Cl Cl O O N C C C C C C C H H H H H
charge: -0.008022 -0.021729 -0.248401 -0.199543 0.004541 0.091840 -0.168727 -0.064285 -0.027889 0.195971 -0.366353 -0.494584 0.292958 0.279310 0.249309 0.246745 0.238859
chargesum: 0.00000
title: Mulliken charges with hydrogens summed into heavy atoms:
elementType: Cl Cl O O N C C C C C C C
charge: -0.008022 -0.021729 -0.248401 -0.199543 0.004541 0.091840 -0.168727 0.228672 -0.027889 0.195971 -0.087043 0.240330
polarizability: 1.64078842e+02 8.50987212e+00 1.05363950e+02 3.09251214e+00 -2.60944767e+00 5.58078796e+01
1716.lowfreq: -6.4204 -2.6051 0.0018 0.0022 0.0027 7.0567 26.3992 55.2400 83.3852
frequency: 26.2035 55.2341 83.3747 93.2634 157.5220 170.8835 176.1860 213.8983 278.5224 285.6007 358.1058 374.5640 427.8968 469.6064 503.6095 564.1011 632.7052 702.3215 736.9614 772.7644 806.1663 884.7244 903.7454 915.1995 1000.8644 1090.3616 1100.8392 1110.9567 1150.8813 1199.4201 1262.3997 1310.0467 1342.1220 1412.9057 1426.5298 1452.4445 1460.8984 1521.3792 1548.9495 1645.3015 3008.7805 3113.0208 3157.6631 3164.1554 3184.5382
redmass: 5.8142 7.1298 1.7092 1.8742 6.1121 5.6803 18.9585 7.0897 13.3276 4.4203 7.4132 13.1396 7.0573 5.8169 8.5027 3.9862 9.7519 7.3864 7.0354 7.9809 8.1056 1.4834 1.4991 5.7352 7.0503 3.9367 2.6873 1.2685 1.5074 2.1935 4.0360 7.0175 2.4369 1.6885 1.5654 1.0499 1.0512 9.4734 7.7370 10.8973 1.0294 1.1050 1.1050 1.0934 1.0943
irintensity: 1.7111 0.9626 1.2355 0.3312 0.0535 4.9772 0.5603 3.9654 0.1487 16.0190 1.3537 8.8558 2.2307 1.7514 26.8398 5.1012 3.9874 16.9670 19.4389 13.9781 45.5481 28.3234 3.1680 0.0869 87.3836 11.7545 253.8993 2.0371 40.2506 31.4342 117.4509 8.5547 42.0867 56.2616 2.9035 14.5771 11.1197 4.3543 70.1623 189.2476 28.6362 19.6319 12.4747 3.5425 1.5450
temp: 298.150 k
press: 1.00000 atm
elementType: 17 17 8 8 7 6 6 6 6 6 6 6 1 1 1 1 1
symmnumber: 1
zpe: 282663.3 jmol-1
zpe.correction: 0.107661 hartree
zpe.thermalcorrener: 0.119497 hartree
zpe.thermalcorrenthalpy: 0.120441 hartree
zpe.thermalcorrgfe: 0.067391 hartree
zpe.sumelectzpe: -1394.171493 hartree
zpe.sumelectthermal: -1394.159657 hartree
zpe.sumelectthermalent: -1394.158713 hartree
zpe.sumelectthermalfe: -1394.211763 hartree
dipole: 0.1163 1.6623 -1.5648
dipole: 2.2859
quadrupole: -70.9555 -84.3755 -86.0633
quadrupole: 2.4789 -6.0926 3.7834
quadrupole: 9.5092 -3.9107 -5.5985 2.4789 -6.0926 3.7834
hfenergy: -1394.2791536 hartree
pointgroup: C01 [X(C7H5Cl2N1O2)]
dipole: 0.0137609 0.2866033 -0.8523429 debye
dipolederiv: -0.2731404 -0.2810119 0.1084148 -0.3175273 -0.556065 0.2283161 0.1147619 0.2274069 -0.1271228 -0.9587371 -0.0286819 -0.047579 0.0119512 -0.089369 0.0241965 -0.0802837 0.0233427 -0.0582807 -1.1568938 0.1059108 0.3434903 0.1038229 -0.2685997 -0.0310214 0.5727999 -0.0695792 -0.8730706 -0.7379656 0.0863371 -0.2854382 0.0926391 -0.2947751 0.0489828 0.0862626 -0.0133188 -0.8605031 -0.2237917 0.0815104 -0.0357465 0.0841972 -0.2876745 0.0396145 -0.1054021 0.0549632 -0.2206317 0.060897 -0.0601013 0.048697 -0.2016439 -0.0512961 0.047723 0.0796863 0.065866 -0.0408573 0.2960984 0.4369576 -0.1835086 0.4813971 0.7847234 -0.3162541 -0.1408486 -0.3492372 0.1421341 -0.3622474 -0.1806193 0.061292 -0.1235677 -0.1346768 0.0322947 0.0451318 0.0247295 -0.0444621 1.3864185 0.0854726 0.0572399 -0.0829118 0.0637882 -0.0437197 0.150327 -0.0284272 0.0061503 1.4806924 -0.2390307 0.0156913 -0.1067477 0.2273401 -0.0425261 -0.5386117 0.0794824 1.4787684 -0.2659429 0.0449179 -0.0368226 0.1709888 0.1792701 -0.0910781 -0.0824802 -0.1052191 0.0310212 0.6540509 -0.0318164 -0.1485917 -0.0655288 0.26529 0.0259555 -0.0879062 0.0076009 0.2472634 0.0885079 0.0238306 -0.0174797 0.0223265 0.0802139 0.0448482 -0.0238042 0.0417247 0.1422812 0.0260302 -0.0591542 0.0226905 -0.0663933 0.0509573 0.042929 0.0283811 0.0399783 0.1271276 -0.0128263 0.018614 0.0341007 0.0649976 -0.0491156 0.054462 -0.053298 0.092675 0.0737729 -0.0381466 -0.0128651 0.0237623 -0.0637612 -0.0392602 -0.0710129 -0.0629962 -0.0882144 0.0562343 0.0369965 0.0097298 0.0397875 -0.0042386 0.1192489 0.00629 0.0982802 -0.0037737 -0.0798251 unknown
polarizability: 163.2815042|10.8510066|92.8163184|-2.9789597|-22.4104568|69.1528489 unknown
InChI: InChI=1S/C7H5Cl2NO2/c1-12-7(11)6-5(9)2-4(8)3-10-6/h2-3H,1H3
charge 0 multiplicity 1
17 atoms
Cl 0.56707 2.247111 -0.978833
Cl -4.313953 -0.262524 -0.120238
O  2.406741 -0.388656 -0.779441
O  2.311656 -0.510169 1.549187
N  -0.476247 -1.33272 0.728481
C  0.254487 -0.287767 0.237886
C  -0.378261 0.821001 -0.375338
C  -1.782942 0.857889 -0.494544
C  -2.506469 -0.24027 0.006842
C  1.748299 -0.396442 0.441573
C  -1.829408 -1.32046 0.615148
C  3.888361 -0.484432 -0.712429
H  -2.286445 1.710644 -0.956429
H  -2.371533 -2.181614 1.016609
H  4.183191 -1.419996 -0.209039
H  4.296666 0.375964 -0.156562
H  4.214286 -0.473656 -1.761072
