program: Gaussian 09
title: 000225548
version: EM64L-G09RevD.01
frameworkgroup: C1[X(C9H16Cl2N2O4)]
method: RPBEPBE
basis: SDD
operation: Freq
keyword: #p
keyword: freq=noraman
keyword: PBEPBE/SDD
title: #p freq=noraman PBEPBE/SDD
converged: YES YES NO NO
title: Mulliken charges:
elementType: Cl Cl O O O O N N C C C C C C C C C H H H H H H H H H H H H H H H H
charge: 0.021455 0.035418 -0.296181 -0.299254 -0.310447 -0.282804 -0.405653 -0.413789 0.389530 -0.699578 -0.684636 0.324283 0.279203 -0.255083 -0.254412 -0.661125 -0.661670 0.394301 0.238103 0.275164 0.256175 0.353319 0.350080 0.236606 0.223239 0.225135 0.237831 0.216396 0.248665 0.228387 0.218985 0.227683 0.244674
chargesum: 0.00000
title: Mulliken charges with hydrogens summed into heavy atoms:
elementType: Cl Cl O O O O N N C C C C C C C C C
charge: 0.021455 0.035418 -0.296181 -0.299254 -0.310447 -0.282804 -0.052334 -0.063709 0.389530 -0.305278 0.084807 0.324283 0.279203 0.204761 0.208553 0.032323 0.029672
polarizability: 1.67982532e+02 6.62788561e+00 1.46210418e+02 -4.67372908e-01 -5.30476251e+00 1.26479872e+02
1716.lowfreq: -24.2946 -7.8694 -3.2095 -0.0014 0.0006 0.0007 1.0771 26.9781 34.3805
frequency: -23.9622 26.7506 34.2223 40.9919 48.6348 66.2394 78.4418 85.1089 90.5618 111.4816 159.9910 174.5739 198.2491 212.5502 221.8262 241.4933 262.5007 270.2509 283.9993 316.8549 322.2742 330.9330 345.6944 402.5504 420.1115 457.8114 478.9526 506.8679 535.0498 563.7385 649.1373 674.2892 702.1984 706.6699 708.5986 724.9141 793.8376 802.5194 803.5962 834.5913 847.2338 936.7365 960.9939 977.0867 992.1308 1043.4536 1046.1112 1095.3211 1095.9537 1121.6974 1148.5058 1155.2582 1157.4060 1167.5199 1210.3735 1221.7200 1229.5039 1281.7269 1282.2233 1296.8691 1356.6304 1358.4022 1384.0426 1388.9314 1391.4808 1451.4581 1457.5969 1459.1906 1462.9541 1464.0125 1476.7010 1480.3189 1483.2215 1485.2674 1493.0597 1637.6926 1659.2321 2992.5616 2992.9570 3016.2052 3029.9462 3031.4668 3087.9671 3088.6671 3092.4683 3093.1057 3119.1169 3119.4864 3123.5165 3132.5533 3143.3573 3534.0416 3569.7297
redmass: 4.1606 3.6133 4.7134 5.0394 4.7666 6.7639 4.5654 4.0223 6.1206 4.8748 2.8709 3.3151 2.9805 1.9490 1.8658 2.1670 2.9339 2.0021 2.0600 3.2481 3.8068 4.3492 4.1362 3.5967 3.2095 1.2833 3.1815 3.1694 1.7970 3.1045 5.4138 4.5267 5.4253 10.7094 11.3490 5.3566 4.1491 1.2179 1.2297 3.3520 3.7666 2.9699 2.7945 2.5630 2.1054 3.5591 4.1570 2.1713 2.1486 3.4176 2.5183 1.7142 1.6793 2.0278 1.8446 1.1725 3.1696 1.1112 1.1105 1.9637 1.2403 1.2489 1.1892 1.2343 1.2354 1.2917 1.0932 1.1673 1.0528 1.0764 1.2614 1.1017 1.0587 1.1109 1.5307 8.2177 8.0583 1.0361 1.0360 1.0343 1.0596 1.0596 1.0972 1.0974 1.1031 1.1033 1.1064 1.1060 1.1011 1.1013 1.0890 1.0773 1.0782
irintensity: 4.9210 0.3555 1.1621 0.2775 3.6421 1.0587 4.2337 0.7379 3.4541 4.1958 2.1572 0.8425 2.3688 2.0905 4.6744 1.3963 0.4808 1.3808 3.8166 15.2337 26.5291 9.5002 6.9467 15.9006 3.5067 21.8795 5.2767 9.7662 58.1524 45.3932 8.8308 11.6515 69.2271 34.4952 40.4348 66.9706 30.0543 6.4347 9.0142 15.0205 6.7765 33.7780 40.4627 11.4845 10.7480 268.3966 222.7774 54.6862 5.4310 49.2569 2.3777 105.8746 19.2443 60.2020 133.9380 48.9044 418.6002 4.4147 5.9577 36.9537 4.2278 1.6004 34.1883 34.3465 28.5663 166.2115 16.4316 198.8146 12.8449 76.0439 130.6596 17.7318 8.0558 56.4808 283.6136 228.6678 212.8225 19.3398 17.3598 6.1134 33.6242 30.2342 39.9836 35.2057 1.4848 0.4695 32.7070 33.5497 4.0071 5.3952 13.7034 62.5559 54.4526
temp: 298.150 k
press: 1.00000 atm
elementType: 17 17 8 8 8 8 7 7 6 6 6 6 6 6 6 6 6 1 1 1 1 1 1 1 1 1 1 1 1 1 1 1 1
symmnumber: 1
zpe: 669993.8 jmol-1
zpe.correction: 0.255187 hartree
zpe.thermalcorrener: 0.274863 hartree
zpe.thermalcorrenthalpy: 0.275807 hartree
zpe.thermalcorrgfe: 0.204712 hartree
zpe.sumelectzpe: -1681.753635 hartree
zpe.sumelectthermal: -1681.733959 hartree
zpe.sumelectthermalent: -1681.733014 hartree
zpe.sumelectthermalfe: -1681.804110 hartree
dipole: 0.8630 -2.3293 0.7937
dipole: 2.6078
quadrupole: -97.2940 -118.2841 -116.4690
quadrupole: 2.0308 -0.4040 -4.5081
quadrupole: 13.3883 -7.6017 -5.7866 2.0308 -0.4040 -4.5081
hfenergy: -1682.0088218 hartree
pointgroup: C01 [X(C9H16Cl2N2O4)]
dipole: 0.3889792 -0.8307547 0.4595505 debye
polarizability: 167.3199576|6.395317|143.7669003|-3.9915909|-9.1179314|129.5859638 unknown
InChI: InChI=1S/C9H16Cl2N2O4/c1-4-16-7(14)12-9(3,6(10)11)13-8(15)17-5-2/h6,12-13H,4-5H2,1-3H3
charge 0 multiplicity 1
33 atoms
Cl -0.142707 2.825899 1.433702
Cl 0.461886 3.527535 -1.462722
O  -2.525954 -1.135759 1.15434
O  3.556976 -0.089311 -0.025361
O  -2.891107 0.584771 -0.419747
O  1.86642 -1.494659 -0.884412
N  -0.738553 -0.042532 0.293361
N  1.462993 0.736749 -0.220672
C  0.052687 0.846245 -0.603878
C  -0.41901 2.314304 -0.351924
C  -0.192686 0.465805 -2.087804
C  -2.111884 -0.133665 0.269252
C  2.245351 -0.384782 -0.42761
C  -4.000108 -1.360551 1.234278
C  4.527345 -1.221008 -0.099729
C  -4.466125 -2.325732 0.141512
C  4.483638 -2.065919 1.176144
H  -1.494787 2.410612 -0.542696
H  0.422131 1.091387 -2.753012
H  0.084074 -0.591349 -2.220889
H  -1.25821 0.601082 -2.335739
H  -0.221956 -0.683354 0.897495
H  1.904181 1.535454 0.241791
H  -4.508528 -0.383833 1.152108
H  -4.139968 -1.778119 2.244212
H  5.498137 -0.716785 -0.229971
H  4.290738 -1.827131 -0.991606
H  -5.541224 -2.548488 0.275276
H  -4.329155 -1.879688 -0.857789
H  -3.907518 -3.276248 0.190682
H  5.273473 -2.839053 1.137513
H  4.656447 -1.441235 2.069469
H  3.510403 -2.575646 1.275425
