program: Gaussian 09
title: 000225533
version: EM64L-G09RevD.01
frameworkgroup: C1[X(C14H13NO)]
method: RPBEPBE
basis: SDD
operation: Freq
keyword: #p
keyword: freq=noraman
keyword: PBEPBE/SDD
title: #p freq=noraman PBEPBE/SDD
converged: YES YES NO NO
title: Mulliken charges:
elementType: O N C C C C C C C C C C C C C C H H H H H H H H H H H H H
charge: -0.260449 -0.453851 -0.650525 0.385986 0.181420 0.470085 -0.376052 -0.383960 -0.223322 -0.223807 -0.447308 -0.348548 -0.238668 -0.198204 -0.214373 -0.254897 0.252457 0.251645 0.337885 0.242671 0.242930 0.224613 0.308234 0.231588 0.231745 0.232572 0.225598 0.226323 0.228210
chargesum: 0.00000
title: Mulliken charges with hydrogens summed into heavy atoms:
elementType: O N C C C C C C C C C C C C C C
charge: -0.260449 -0.115966 -0.146423 0.385986 0.181420 0.470085 -0.133381 -0.141029 0.008266 0.007938 -0.222695 -0.040315 -0.006096 0.027394 0.011951 -0.026687
polarizability: 1.97703853e+02 -1.00979187e+01 1.68232947e+02 -7.27262851e-01 7.85822673e-01 1.07704250e+02
1716.lowfreq: -12.0091 -0.0004 0.0003 0.0007 4.7652 7.4403 9.1527 21.4193 49.0042
frequency: 5.0267 20.5300 48.9784 64.0200 85.1284 146.7410 213.2696 253.3809 318.3926 320.8080 356.5306 401.6137 408.5347 433.8684 502.4005 522.1393 574.8288 602.3160 615.8098 616.8442 658.3189 686.4792 700.0936 706.1502 762.4865 770.6824 817.4504 846.2463 852.0353 858.2412 917.0663 918.5225 920.6869 933.1700 974.6620 980.3087 985.0116 989.2817 998.9182 1002.2379 1026.4249 1027.0931 1081.2845 1088.4864 1171.8667 1172.6788 1177.9535 1182.7980 1187.3785 1189.8742 1215.9801 1260.8992 1288.3870 1322.7142 1327.5681 1379.5866 1385.3555 1429.9997 1439.3788 1450.0953 1483.0200 1486.0127 1515.8078 1589.4070 1599.5244 1610.6998 1614.1916 1619.8726 3008.4238 3062.8989 3112.3580 3121.1737 3122.0397 3131.4022 3137.1342 3144.1990 3148.6542 3164.3686 3166.3723 3193.5745 3485.0432
redmass: 3.9168 3.7276 5.3259 5.1657 4.6533 5.3654 4.8857 3.9886 2.2076 6.4459 5.9917 2.8182 2.9275 4.9143 2.9847 4.1690 3.6283 5.5243 6.3205 6.3583 4.8294 1.1747 1.9220 1.7933 1.9341 1.6890 4.6983 1.2665 4.1743 1.2491 2.1834 2.4926 1.4342 2.0781 1.3488 1.3871 6.2018 6.2836 1.3116 1.3054 2.1893 2.1370 1.5963 1.5461 1.0707 1.0865 1.2733 2.2069 1.1387 1.1533 2.3711 2.0782 1.5710 1.4363 1.2701 8.0684 6.7442 2.2862 2.1747 1.1274 2.3198 2.3419 2.0945 5.9794 6.2755 5.4249 5.4929 6.2974 1.0608 1.1001 1.0884 1.0869 1.0878 1.0869 1.0911 1.0935 1.0959 1.0999 1.1015 1.0952 1.0761
irintensity: 0.9487 1.0594 0.0552 5.3402 0.0376 0.9623 6.1805 0.9898 1.1965 3.8273 1.3485 0.0023 0.0089 1.2967 18.5606 44.5017 0.7530 2.2074 0.5062 0.0718 6.7099 2.1433 57.1146 57.5574 31.6688 91.5538 3.2024 0.0181 0.9779 0.1466 2.4263 3.0683 11.4623 7.0921 0.2056 0.0668 0.2677 0.0901 0.2121 3.1260 7.8356 3.2192 11.6737 21.1061 2.2727 0.8467 11.0898 32.8390 5.5861 7.1152 3.4067 25.5876 13.2112 35.9992 0.1823 0.0177 49.2315 91.7818 8.3368 12.6669 26.9872 44.7607 381.1428 1.6912 68.6658 66.0591 64.9601 148.4114 12.1967 3.6596 13.2986 6.1009 3.4625 0.9581 7.6185 31.2714 33.9199 25.4002 19.3900 7.2014 67.1734
temp: 298.150 k
press: 1.00000 atm
elementType: 8 7 6 6 6 6 6 6 6 6 6 6 6 6 6 6 1 1 1 1 1 1 1 1 1 1 1 1 1
symmnumber: 1
zpe: 610760.6 jmol-1
zpe.correction: 0.232626 hartree
zpe.thermalcorrener: 0.246167 hartree
zpe.thermalcorrenthalpy: 0.247112 hartree
zpe.thermalcorrgfe: 0.188139 hartree
zpe.sumelectzpe: -670.163541 hartree
zpe.sumelectthermal: -670.150000 hartree
zpe.sumelectthermalent: -670.149056 hartree
zpe.sumelectthermalfe: -670.208028 hartree
dipole: 2.4595 -3.3605 -0.0897
dipole: 4.1653
quadrupole: -86.2510 -96.0255 -91.3067
quadrupole: 1.0128 -0.0705 0.0115
quadrupole: 4.9434 -4.8311 -0.1123 1.0128 -0.0705 0.0115
hfenergy: -670.396167 hartree
pointgroup: C01 [X(C14H13N1O1)]
dipole: -0.8963659 -0.8631204 1.0663345 debye
polarizability: 195.6469991|14.189017|130.3649391|-3.9516205|-29.1081168|147.6291122 unknown
InChI: InChI=1S/C14H13NO/c16-14(11-12-7-3-1-4-8-12)15-13-9-5-2-6-10-13/h1-10,15H,11H2
charge 0 multiplicity 1
29 atoms
O  0.747317 1.690605 -2.351005
N  0.518257 0.331185 -0.446475
C  -1.512553 1.007369 -1.70948
C  -2.299843 0.141822 -0.741431
C  0.029083 1.040285 -1.535078
C  1.867238 0.173943 -0.01505
C  -2.528694 -1.232962 -1.018325
C  -2.804843 0.680291 0.472488
C  -3.24044 -2.047104 -0.10861
C  -3.51681 -0.1312 1.385181
C  2.089911 -0.622064 1.14182
C  2.970183 0.770245 -0.68363
C  -3.736157 -1.498603 1.097618
C  3.397916 -0.820944 1.626606
C  4.274035 0.560307 -0.183968
C  4.50075 -0.230019 0.966018
H  -1.682444 0.691156 -2.75486
H  -1.839381 2.062332 -1.652262
H  -0.190312 -0.146929 0.119559
H  -2.152009 -1.662849 -1.954658
H  -2.644874 1.741964 0.697811
H  1.238401 -1.083832 1.658612
H  2.791559 1.379306 -1.571496
H  -3.412096 -3.103833 -0.341875
H  -3.903468 0.303079 2.313876
H  -4.291675 -2.127693 1.801811
H  3.555106 -1.436839 2.51903
H  5.121017 1.022632 -0.703511
H  5.517728 -0.383851 1.342187
