program: Gaussian 09
title: 000225524
version: EM64L-G09RevD.01
frameworkgroup: C1[X(C8H6BrCl2NO)]
method: RPBEPBE
basis: SDD
operation: Freq
keyword: #p
keyword: freq=noraman
keyword: PBEPBE/SDD
title: #p freq=noraman PBEPBE/SDD
converged: YES YES NO NO
title: Mulliken charges:
elementType: Br Cl Cl O N C C C C C C C C H H H H H H
charge: -0.008552 -0.034455 -0.040816 -0.238182 -0.431086 0.655326 -0.409548 -0.266286 -0.110081 -0.191570 -0.249475 0.268499 -0.761591 0.336703 0.324569 0.262573 0.265747 0.314105 0.314120
chargesum: 0.00000
title: Mulliken charges with hydrogens summed into heavy atoms:
elementType: Br Cl Cl O N C C C C C C C C
charge: -0.008552 -0.034455 -0.040816 -0.238182 -0.106517 0.655326 -0.409548 0.070417 -0.110081 0.071003 0.016272 0.268499 -0.133367
polarizability: 1.98850840e+02 1.45257840e+01 1.53232731e+02 7.69111718e-02 -1.68354769e-01 5.03183235e+01
1716.lowfreq: -4.2331 -0.0017 -0.0008 0.0016 2.6364 3.5639 23.0072 68.1096 69.4551
frequency: 22.9081 68.1091 69.4526 85.1956 97.3698 117.0549 195.5694 234.4760 271.1356 307.6722 309.3571 332.2020 405.3593 446.1091 472.3664 515.4747 540.9410 594.2911 633.3958 655.1538 708.7506 720.1005 769.6048 800.5456 871.2899 893.0577 920.3434 938.1107 944.4727 1014.1844 1081.7180 1135.1785 1147.9848 1209.2358 1236.4573 1240.8519 1273.4213 1372.6720 1405.5482 1414.1068 1444.7683 1517.3941 1575.3534 1598.3221 1608.1459 3066.9524 3147.7628 3167.9950 3187.3258 3190.9574 3409.9683
redmass: 9.0636 20.9335 3.8404 4.5712 9.3829 25.3266 16.2551 5.1296 9.9349 5.8087 26.8193 14.0213 6.4168 3.2060 6.1812 9.3327 3.2806 4.0629 6.5354 5.6829 3.1903 7.3371 1.2872 1.3250 1.7287 6.6040 1.3911 1.3467 6.3974 6.8808 1.8761 1.4195 1.1280 3.0672 1.2397 1.6679 1.5889 8.5190 2.8334 1.2357 2.6026 2.6540 4.2873 8.4521 6.6349 1.0566 1.1085 1.0892 1.0975 1.0937 1.0768
irintensity: 0.3445 0.4495 13.9611 0.9577 0.7416 2.4693 2.6397 0.5478 6.0718 1.3409 0.0310 4.2838 15.9974 16.2267 11.0187 25.0558 1.1851 2.2252 16.8798 92.7866 6.0835 0.4897 45.1221 52.9107 23.5677 40.6306 30.5961 4.8665 7.9289 64.5208 21.6502 1.0317 0.0467 29.0516 51.7080 2.6131 8.9105 49.3825 95.3694 7.3787 47.0218 564.9507 45.1116 253.7327 58.0651 1.8704 0.0047 0.3222 0.0214 18.6469 96.8055
temp: 298.150 k
press: 1.00000 atm
elementType: 35 17 17 8 7 6 6 6 6 6 6 6 6 1 1 1 1 1 1
symmnumber: 1
zpe: 325301.6 jmol-1
zpe.correction: 0.123901 hartree
zpe.thermalcorrener: 0.136664 hartree
zpe.thermalcorrenthalpy: 0.137608 hartree
zpe.thermalcorrgfe: 0.081383 hartree
zpe.sumelectzpe: -1371.084387 hartree
zpe.sumelectthermal: -1371.071624 hartree
zpe.sumelectthermalent: -1371.070680 hartree
zpe.sumelectthermalfe: -1371.126905 hartree
dipole: 0.5596 1.8344 0.0051
dipole: 1.9178
quadrupole: -98.0416 -100.0488 -100.1920
quadrupole: -12.0335 0.0681 -0.0002
quadrupole: 1.3859 -0.6213 -0.7645 -12.0335 0.0681 -0.0002
hfenergy: -1371.2082876 hartree
pointgroup: C01 [X(C8H6Br1Cl2N1O1)]
dipole: -0.0555645 0.7352366 0.1601647 debye
dipolederiv: -0.3994222 -0.123651 0.0027591 -0.3731609 -0.4433169 -0.0322615 -0.0457931 -0.0550336 -0.1120164 -0.2447932 -0.2431316 -0.0320336 -0.2050716 -0.5895756 -0.0973611 -0.0238488 -0.0937511 -0.0546297 -0.3159488 -0.2830552 -0.0358397 -0.366508 -0.6278254 -0.0858905 -0.0535962 -0.0936528 -0.0734609 -0.7675063 -0.2976857 -0.0199647 0.4500888 -0.9344522 -0.1617871 0.130398 -0.0945341 -0.3719016 -1.7617459 0.231943 0.1854684 0.513022 -0.5806019 -0.1114732 0.2432719 -0.0861715 -0.3077235 1.1707544 -0.1685381 -0.130155 0.1005035 -0.0720934 -0.0527371 -0.0744964 -0.0278108 0.1399302 -0.0061531 0.390669 0.0710317 0.4234671 0.7909788 0.1544913 0.0774044 0.1570061 -0.1030127 -0.4064205 -0.0655948 0.013398 -0.2698055 -0.265288 -0.0074312 -0.0294924 -0.0265899 -0.1147543 0.5021785 0.4253235 0.0374811 0.6179223 1.0043989 0.1675977 0.0784849 0.1851572 -0.0319898 0.0561862 -0.0045718 -0.0123942 -0.1098489 -0.0785496 0.0078774 -0.0345897 -0.0014676 -0.0668536 -0.1601979 -0.0847962 -0.014732 -0.1193099 -0.3041468 -0.0260939 -0.0218829 -0.0293695 -0.1321822 1.5815721 0.1065626 -0.1069514 -1.2013848 1.0107185 0.2760233 -0.3716973 0.1566537 0.270575 -0.0418783 0.1100727 0.0312469 0.5519972 0.7100772 0.0759705 0.1181035 0.117627 0.0752767 0.2146394 0.0354894 0.0048488 -0.0009177 0.1029256 -0.0180537 -0.0022344 -0.0209468 0.1843311 0.4306957 0.043164 -0.0066296 0.0268972 0.2382462 -0.0105941 -0.0097726 -0.012275 0.2772779 0.0698828 0.0321237 0.0154821 0.0499952 0.0014453 -0.0389405 0.0191837 -0.0372529 0.1561929 -0.023333 -0.0150024 0.0149292 -0.0212168 0.0926743 -0.0153975 0.0135479 -0.0158509 0.1707293 0.0425759 -0.0380743 -0.0295721 -0.0152429 -0.0441706 0.0463103 -0.0695076 0.0100448 0.0712413 0.0589141 -0.0512467 0.011627 -0.0514261 -0.0114444 -0.0702492 0.0565171 -0.0317822 0.0229704 unknown
polarizability: 181.9949792|27.8731285|165.1336177|-6.3751073|21.1470702|55.2732972 unknown
InChI: InChI=1S/C8H6BrCl2NO/c9-4-8(13)12-7-3-5(10)1-2-6(7)11/h1-3,12H,4H2
charge 0 multiplicity 1
19 atoms
Br 4.051457 1.764124 -0.143007
Cl -0.169084 3.031065 0.531956
Cl -3.137763 -2.589878 -0.375502
O  1.842944 -1.795729 -0.653103
N  1.185999 0.410436 -0.141356
C  -0.220323 0.276291 -0.040226
C  -1.002711 1.423349 0.271206
C  -0.894396 -0.960362 -0.238103
C  -2.293335 -0.999033 -0.118587
C  -2.39976 1.365252 0.386349
C  -3.067751 0.135618 0.189733
C  2.107712 -0.57586 -0.428101
C  3.588468 -0.185189 -0.484274
H  -0.312464 -1.851819 -0.478068
H  1.561172 1.356189 0.017609
H  -2.965878 2.269015 0.627006
H  -4.155172 0.071679 0.275123
H  4.142262 -0.759106 0.273819
H  3.983119 -0.41344 -1.485674
