program: Gaussian 09
title: 000225527
version: EM64L-G09RevD.01
frameworkgroup: C1[X(C8H15Cl2NO)]
method: RPBEPBE
basis: SDD
operation: Freq
keyword: #p
keyword: freq=noraman
keyword: PBEPBE/SDD
title: #p freq=noraman PBEPBE/SDD
converged: NO YES NO NO
title: Mulliken charges:
elementType: Cl Cl O N C C C C C C C C H H H H H H H H H H H H H H H
charge: 0.026896 -0.000802 -0.248341 -0.313013 0.023804 -0.399326 -0.368262 -0.463496 -0.712210 -0.725274 0.377298 -0.700872 0.187540 0.198555 0.210189 0.207169 0.192541 0.262985 0.236010 0.212779 0.217417 0.223871 0.201543 0.216452 0.257786 0.320428 0.358334
chargesum: 0.00000
title: Mulliken charges with hydrogens summed into heavy atoms:
elementType: Cl Cl O N C C C C C C C C
charge: 0.026896 -0.000802 -0.248341 0.007415 0.211344 0.009417 0.031448 0.035499 -0.058144 -0.049493 0.377298 -0.342537
polarizability: 1.18840244e+02 -1.84110792e+00 1.23810100e+02 -9.53910861e-01 -1.16977524e+00 1.01451544e+02
1716.lowfreq: -23.0626 -15.1076 -7.5209 0.0028 0.0035 0.0040 8.9307 31.7151 42.6462
frequency: 4.6587 31.3848 42.4935 55.6946 78.3829 95.3199 138.2391 173.4826 185.3412 211.2865 226.7235 240.4437 256.2810 289.4608 349.0808 380.0963 389.3856 447.3400 527.0979 584.1929 628.6145 647.8857 684.3732 742.8169 755.7950 762.5983 821.7791 850.4680 902.5938 948.1126 978.5474 1024.0280 1043.1393 1045.9759 1071.0593 1127.9774 1133.3078 1165.6264 1184.4845 1200.7343 1233.9050 1240.3093 1253.1869 1269.5277 1273.4728 1328.1260 1344.7972 1348.0679 1362.7453 1391.4481 1394.7167 1464.1035 1465.5587 1474.6235 1477.1010 1482.5280 1485.9481 1498.3196 1508.1887 1625.4295 2949.1286 2964.7940 2971.4872 2972.2058 2973.2875 3013.0452 3014.1126 3022.9979 3063.5579 3067.4239 3073.2041 3077.2181 3089.2746 3165.4002 3523.0103
redmass: 6.8431 4.8204 6.0405 4.2888 2.3047 1.8623 4.1122 1.9033 2.7028 2.6773 3.1969 1.4479 6.0720 2.9061 2.4595 10.3053 3.4653 2.0659 2.2750 2.8065 3.0963 2.1161 5.5636 6.0677 1.4909 1.6453 1.5707 1.8888 2.6983 1.8310 1.3966 2.4632 2.3689 1.5010 3.1464 1.9385 2.1858 2.6293 1.0798 1.2703 1.3521 1.6307 1.2705 1.2159 1.2169 1.3963 1.3744 1.6521 1.2988 1.2101 1.2048 1.0724 1.0704 1.0684 1.0496 1.0761 1.0690 1.0561 1.7461 8.0390 1.0813 1.0607 1.0596 1.0373 1.0390 1.0686 1.0986 1.0977 1.0998 1.0989 1.0988 1.1004 1.0975 1.0897 1.0772
irintensity: 0.0765 1.5643 0.2878 6.5260 0.2224 0.2000 1.7827 1.4908 0.3151 2.4580 1.9934 0.0317 13.8954 0.1836 5.1508 4.7723 0.2842 1.5592 46.6205 20.0992 108.4494 44.5618 66.6217 46.0274 3.9132 12.1850 0.4391 12.8708 3.3742 4.7949 11.2671 0.6190 5.1584 7.6110 0.1460 2.2005 11.4935 1.9044 13.3489 9.9258 5.7006 9.3064 1.8794 31.9647 9.5184 0.2990 2.5786 4.8189 2.8615 20.0631 16.4425 16.1581 4.2429 0.0710 1.6719 50.8486 4.3690 24.6250 152.2595 214.1205 12.1822 7.0498 73.1567 35.7284 17.9966 41.6805 0.8276 49.0418 63.7519 54.2529 42.2051 40.3491 2.6091 0.6489 27.3811
temp: 298.150 k
press: 1.00000 atm
elementType: 17 17 8 7 6 6 6 6 6 6 6 6 1 1 1 1 1 1 1 1 1 1 1 1 1 1 1
symmnumber: 1
zpe: 581914.8 jmol-1
zpe.correction: 0.221640 hartree
zpe.thermalcorrener: 0.236792 hartree
zpe.thermalcorrenthalpy: 0.237737 hartree
zpe.thermalcorrgfe: 0.175153 hartree
zpe.sumelectzpe: -1362.981304 hartree
zpe.sumelectthermal: -1362.966151 hartree
zpe.sumelectthermalent: -1362.965207 hartree
zpe.sumelectthermalfe: -1363.027790 hartree
dipole: 2.2461 2.3266 0.4038
dipole: 3.2590
quadrupole: -84.9540 -91.8467 -91.2815
quadrupole: 1.8923 0.8297 -3.1969
quadrupole: 4.4067 -2.4859 -1.9208 1.8923 0.8297 -3.1969
hfenergy: -1363.2029434 hartree
pointgroup: C01 [X(C8H15Cl2N1O1)]
dipole: 1.1113288 -0.6216363 -0.1499427 debye
polarizability: 117.6338224|-0.3590826|123.7263935|3.3774829|3.9265608|102.7416721 unknown
InChI: InChI=1S/C8H15Cl2NO/c1-3-6(4-2)5-11-8(12)7(9)10/h6-7,11H,3-5H2,1-2H3
charge 0 multiplicity 1
27 atoms
Cl -2.356597 0.293261 -2.085672
Cl -2.57962 -2.458969 -0.729186
O  -1.572054 0.751547 1.31857
N  -0.153187 -0.811115 0.293976
C  2.162272 0.204895 0.161149
C  2.644039 -0.723838 -0.988407
C  1.714943 1.581385 -0.401891
C  1.067095 -0.458341 1.043893
C  3.215681 -2.086596 -0.536601
C  1.40791 2.650616 0.670078
C  -1.348873 -0.174031 0.479137
C  -2.504275 -0.598011 -0.440767
H  3.025653 0.37534 0.842183
H  1.812523 -0.881789 -1.706878
H  3.42568 -0.181102 -1.556029
H  0.824969 1.43806 -1.047809
H  2.521297 1.953193 -1.066205
H  0.756727 0.226001 1.850353
H  1.46791 -1.374367 1.516659
H  2.45205 -2.727481 -0.057232
H  4.039232 -1.950465 0.189722
H  3.618436 -2.648608 -1.398778
H  2.263396 2.780521 1.360666
H  1.208848 3.629317 0.196413
H  0.515347 2.388346 1.265383
H  -0.113663 -1.576443 -0.384447
H  -3.46724 -0.302625 -0.010281
