program: Gaussian 09
title: 000225532
version: EM64L-G09RevD.01
frameworkgroup: C1[X(C14H13BrO)]
method: RPBEPBE
basis: SDD
operation: Freq
keyword: #p
keyword: freq=noraman
keyword: PBEPBE/SDD
title: #p freq=noraman PBEPBE/SDD
converged: YES YES NO NO
title: Mulliken charges:
elementType: Br O C C C C C C C C C C C C C C H H H H H H H H H H H H H
charge: -0.005196 -0.442780 -0.635260 0.309001 0.538852 -0.460345 0.123746 0.457362 -0.387529 -0.416779 -0.388930 -0.391516 -0.820715 -0.198313 -0.236759 -0.235459 0.263021 0.240026 0.244289 0.215022 0.230226 0.245571 0.233170 0.220065 0.227652 0.249694 0.231311 0.234349 0.356224
chargesum: 0.00000
title: Mulliken charges with hydrogens summed into heavy atoms:
elementType: Br O C C C C C C C C C C C C C C
charge: -0.005196 -0.086557 -0.132213 0.309001 0.538852 -0.216056 0.123746 0.457362 -0.172507 -0.186553 -0.388930 -0.145945 -0.139828 0.051381 -0.005448 -0.001110
polarizability: 1.87710844e+02 2.95469407e+01 1.62050712e+02 -2.23270452e+00 -1.99666502e+00 1.42944680e+02
1716.lowfreq: -11.5074 -3.2609 -0.0007 -0.0005 0.0004 5.3671 6.6931 23.0676 57.5821
frequency: -4.1863 23.0349 57.5627 58.3025 124.4572 129.0255 154.0552 180.8538 231.7100 243.3315 294.7560 313.1774 333.5398 353.6414 389.5354 431.0111 432.8309 453.6291 468.1736 495.6736 554.7852 577.5284 607.0747 646.8011 700.1800 709.4133 725.0078 755.7009 787.8952 796.3062 828.1709 871.0937 882.1039 918.0002 926.6457 943.6305 950.9435 986.0924 1003.2280 1004.4927 1040.3538 1048.4874 1077.6864 1116.4231 1153.5518 1160.0120 1171.1291 1187.6182 1212.1822 1226.1385 1252.5182 1277.9583 1292.7979 1322.8641 1368.3169 1385.8559 1398.8766 1418.6384 1421.8801 1458.0100 1462.2519 1470.6373 1477.8873 1500.4589 1569.6395 1599.8802 1608.7133 1622.8568 2973.3924 2988.3407 3035.9130 3050.2502 3080.4959 3108.0281 3126.4518 3129.4404 3139.4479 3140.4224 3157.6585 3172.8467 3584.2357
redmass: 5.3094 7.2138 1.0911 3.9243 4.2582 4.7351 4.1712 5.4691 3.8137 4.6161 6.0895 3.4533 2.6192 1.3285 2.5131 3.0246 3.6381 4.3340 4.4783 4.4652 3.0453 5.0077 4.5987 6.4559 5.5829 3.3278 4.4153 1.3444 3.8638 1.4211 3.5366 1.5070 1.3959 1.4647 3.0418 1.5651 1.4270 1.3287 1.7272 4.9997 2.1990 1.5311 2.4136 1.6922 1.5490 1.2621 1.0711 1.1130 2.1082 1.8046 2.6818 1.4689 1.8032 1.4960 7.4560 3.7519 1.3460 2.4115 2.7300 1.6558 1.5127 1.0459 1.1621 2.6844 5.9676 6.9527 6.4727 6.4520 1.0371 1.0613 1.0979 1.0977 1.0986 1.0879 1.0869 1.0910 1.0960 1.0895 1.0949 1.0997 1.0659
irintensity: 0.4818 0.2734 0.3809 0.4319 0.0818 0.2378 4.4997 2.1234 3.3536 3.8112 5.3557 0.7481 13.3075 106.3395 3.6524 4.3634 3.0998 4.9563 12.6990 1.1720 9.8278 8.0755 3.4080 18.2221 6.1885 0.1455 6.7152 54.5631 29.8831 47.3577 6.4395 2.6990 0.7339 1.6770 5.6194 3.3367 2.8959 0.0449 10.7247 55.3504 2.2674 10.6304 119.8036 2.8050 21.9176 84.7226 1.1769 1.4633 0.1937 6.2663 58.3228 0.4681 3.2014 6.1740 2.1963 7.0311 14.9414 12.2953 13.5145 29.0064 29.1215 13.2143 18.0461 71.1988 12.5177 2.5443 0.8802 12.9542 40.1747 11.9837 4.2947 21.0625 22.2827 19.2629 4.8409 12.4479 20.0965 9.7246 17.9478 16.5728 30.6383
temp: 298.150 k
press: 1.00000 atm
elementType: 35 8 6 6 6 6 6 6 6 6 6 6 6 6 6 6 1 1 1 1 1 1 1 1 1 1 1 1 1
symmnumber: 1
zpe: 594148.9 jmol-1
zpe.correction: 0.226299 hartree
zpe.thermalcorrener: 0.240515 hartree
zpe.thermalcorrenthalpy: 0.241459 hartree
zpe.thermalcorrgfe: 0.183594 hartree
zpe.sumelectzpe: -628.839459 hartree
zpe.sumelectthermal: -628.825243 hartree
zpe.sumelectthermalent: -628.824299 hartree
zpe.sumelectthermalfe: -628.882164 hartree
dipole: -1.1602 1.4518 0.5072
dipole: 1.9264
quadrupole: -86.4305 -98.4629 -100.7742
quadrupole: 10.7338 -3.2549 -1.9912
quadrupole: 8.7921 -3.2403 -5.5517 10.7338 -3.2549 -1.9912
hfenergy: -629.0657584 hartree
pointgroup: C01 [X(C14H13Br1O1)]
dipole: 0.4057399 0.4528006 -0.4525071 debye
polarizability: 187.1581189|-29.7636555|163.0549928|0.9379465|-0.1870388|142.4931249 unknown
InChI: InChI=1S/C14H13BrO/c1-10-6-7-14(16)12(8-10)9-11-4-2-3-5-13(11)15/h2-8,16H,9H2,1H3
charge 0 multiplicity 1
29 atoms
Br -1.512031 -1.511409 2.151964
O  1.883697 -2.520263 -1.379648
C  -0.380377 -0.995017 -0.886162
C  0.993865 -0.487714 -0.445853
C  -1.554868 -0.135554 -0.458517
C  1.204617 0.744188 0.207539
C  2.131194 -1.296405 -0.717394
C  2.496152 1.189353 0.598668
C  3.426449 -0.883302 -0.343159
C  3.602877 0.356829 0.313077
C  -2.173127 -0.222156 0.815238
C  -2.095916 0.821515 -1.360634
C  2.671832 2.520641 1.310105
C  -3.269465 0.58495 1.186124
C  -3.189416 1.643764 -1.015221
C  -3.779928 1.525094 0.263021
H  -0.5008 -2.027792 -0.508406
H  -0.379094 -1.085376 -1.989757
H  0.335706 1.376217 0.426147
H  4.294914 -1.519928 -0.55904
H  4.611499 0.673364 0.603425
H  -1.637141 0.911622 -2.352459
H  2.135098 2.533948 2.277761
H  3.735926 2.731248 1.51462
H  2.272888 3.358195 0.707207
H  -3.718136 0.479545 2.178149
H  -3.579585 2.36783 -1.738341
H  -4.632097 2.152312 0.545705
H  2.724164 -3.027698 -1.498959
