program: Gaussian 09
title: 000225536
version: EM64L-G09RevD.01
frameworkgroup: C1[X(C16H34N2O)]
method: RPBEPBE
basis: SDD
operation: Freq
keyword: #p
keyword: freq=noraman
keyword: PBEPBE/SDD
title: #p freq=noraman PBEPBE/SDD
converged: YES YES NO NO
title: Mulliken charges:
elementType: O N N C C C C C C C C C C C C C C C C H H H H H H H H H H H H H H H H H H H H H H H H H H H H H H H H H H
charge: -0.265421 -0.383533 -0.505454 -0.387105 -0.385395 -0.385134 -0.387247 -0.385396 -0.383831 -0.381523 -0.386778 -0.373129 -0.367970 -0.353125 -0.372462 -0.356872 -0.516727 -0.696732 0.214502 0.194266 0.193471 0.192821 0.193614 0.193174 0.192981 0.195530 0.193628 0.193169 0.192908 0.194180 0.191935 0.191609 0.191584 0.194130 0.199019 0.189275 0.189403 0.191514 0.189122 0.187447 0.187426 0.200995 0.238632 0.194680 0.194838 0.232959 0.203735 0.209622 0.214870 0.209492 0.318133 0.305117 0.304053
chargesum: 0.00000
title: Mulliken charges with hydrogens summed into heavy atoms:
elementType: O N N C C C C C C C C C C C C C C C C
charge: -0.265421 -0.065400 0.103716 0.000632 0.001041 0.001021 0.001910 0.000681 0.002284 0.001670 0.006371 0.005550 0.012665 0.021748 0.067165 0.032646 -0.080032 -0.062748 0.214502
polarizability: 2.67789279e+02 2.12042674e+00 1.65590682e+02 4.66951156e+00 -1.90087108e+00 1.53351613e+02
1716.lowfreq: -30.1461 -5.9108 -4.1857 -0.0021 0.0010 0.0017 3.1180 9.4422 16.9123
frequency: -21.3647 7.3822 16.6274 21.2163 36.7906 44.2762 46.7895 61.6048 78.9108 82.4739 93.0084 107.6493 116.0806 119.5684 127.7095 133.3998 137.3595 142.3464 151.6036 154.9074 184.3159 224.2549 235.8229 238.0145 257.8829 293.1596 344.8974 357.9436 407.6776 435.9725 453.8021 496.7438 501.3535 552.7079 624.8880 716.4559 718.1476 720.8130 723.3443 726.4682 735.4503 750.1353 772.6653 781.5821 803.4396 840.0695 880.6407 887.8830 922.7046 938.9708 964.4654 975.2316 979.9071 1001.8492 1004.6728 1009.5293 1032.6341 1034.6591 1045.6622 1057.5909 1071.7646 1075.6436 1078.9605 1079.5528 1082.1048 1082.4282 1092.5471 1123.9113 1149.8691 1179.3913 1193.5918 1195.8422 1212.5827 1218.7465 1231.6354 1238.8670 1247.9441 1256.1791 1264.1124 1271.7952 1276.9581 1279.8763 1282.4932 1284.0360 1286.3210 1288.5769 1291.9710 1294.5578 1296.1225 1297.6017 1309.1244 1324.3211 1338.6083 1348.4395 1351.7649 1354.2548 1355.1291 1358.2853 1359.1469 1389.1104 1436.5755 1444.4817 1457.2265 1457.2641 1460.0500 1460.2999 1462.5120 1463.7307 1465.6744 1469.2147 1473.5363 1477.5054 1478.0732 1481.9054 1485.2787 1487.7944 1488.9004 1619.8723 1680.0162 2947.3551 2947.5605 2948.6566 2948.8593 2949.7436 2951.1370 2951.3037 2954.1463 2957.6903 2961.2676 2964.4987 2966.8906 2971.0041 2972.2821 2979.6362 2981.4404 2982.1818 2984.6028 2988.0973 2992.4382 2997.6892 3005.3747 3013.8862 3021.9031 3025.2552 3030.9037 3037.5320 3042.3450 3060.0120 3067.6112 3069.6467 3389.7186 3503.4828 3550.8558
redmass: 1.9963 4.3941 4.4618 4.5306 3.3112 3.5919 1.8176 2.9840 1.7486 3.5661 2.7195 1.7970 3.6433 2.5388 1.6702 1.9647 2.0141 2.2975 2.0117 2.0408 2.9155 3.0635 1.1289 3.8519 3.3902 3.7042 3.7044 3.5491 3.1712 3.4666 2.9880 3.0271 2.9940 1.3813 2.2362 1.0583 1.0638 1.0725 1.9737 1.2808 1.1965 1.1960 1.2453 1.7153 1.2386 1.2591 1.2704 1.8977 1.2794 5.7353 1.2617 5.0205 4.8124 1.3829 3.2699 3.2091 1.1816 2.8898 3.1813 3.0978 2.4472 1.7772 2.0466 2.1608 2.1561 2.2324 2.8900 2.9977 2.3735 1.9411 1.6957 1.2634 1.5419 1.3206 1.4785 1.3658 1.4684 1.3631 1.3364 1.2888 1.0167 1.1646 1.0830 1.1736 1.1749 1.0987 1.0991 1.1596 1.1082 1.1884 1.3309 1.3985 1.4456 1.5103 1.7082 1.6202 1.6422 1.6073 1.6327 1.2171 1.7133 1.0966 1.0747 1.0748 1.0726 1.0720 1.0672 1.0710 1.0768 1.0855 1.0869 1.0583 1.0724 1.0908 1.0935 1.0902 1.0995 7.0336 1.0640 1.0585 1.0584 1.0589 1.0588 1.0590 1.0595 1.0593 1.0595 1.0593 1.0589 1.0585 1.0583 1.0366 1.0592 1.0959 1.0884 1.0783 1.0940 1.0961 1.0983 1.1009 1.1030 1.1039 1.1028 1.1011 1.1050 1.1048 1.1045 1.1030 1.1007 1.0993 1.0428 1.0985 1.0795
irintensity: 1.1183 0.0753 0.1073 0.5208 0.2126 0.5423 0.2012 0.1065 0.1486 0.5332 0.2056 0.0488 0.1986 0.5053 15.0826 0.2718 4.2409 0.3775 0.0659 0.0228 3.0094 8.3319 0.1161 5.7485 8.7926 13.4051 1.6083 5.9229 2.5789 1.7716 2.9014 3.1844 0.5867 132.2772 28.6271 18.8741 1.7638 10.6153 2.4902 0.8633 3.9680 0.1153 2.7120 130.8141 2.8882 2.1544 0.4226 4.7620 1.5728 14.5946 0.4490 0.0583 0.9621 0.8710 0.8831 0.0961 0.0986 0.5395 0.3514 0.2333 0.8797 10.8647 0.1019 0.4487 0.1148 0.0775 2.3788 12.8802 3.7772 0.2253 0.2561 34.5960 1.8608 0.8547 6.0436 1.2451 18.7309 3.3243 12.9190 2.3423 0.1004 2.8034 1.4542 2.0076 0.1290 1.6285 0.1472 0.5815 0.0228 0.5463 5.3895 4.4828 6.2527 2.0707 1.4932 2.7269 1.0136 1.1494 0.3907 11.2709 177.7049 10.7316 0.0078 0.0147 0.0061 0.0280 0.0027 0.1910 0.1822 0.1538 1.3670 8.0789 4.7016 2.0429 0.3376 7.6850 50.6130 167.9985 26.3034 0.0032 0.1099 0.1964 0.5685 1.5255 1.9865 4.0630 0.4201 4.9426 9.5589 181.1229 227.3011 36.5216 9.3914 0.0424 12.1379 33.6503 7.0717 5.0044 3.6877 2.0515 0.8594 3.2023 2.7557 9.7729 8.9161 3.6519 356.3097 94.7514 97.7702 55.6153 0.1186 1.4340 27.8948
temp: 298.150 k
press: 1.00000 atm
elementType: 8 7 7 6 6 6 6 6 6 6 6 6 6 6 6 6 6 6 6 1 1 1 1 1 1 1 1 1 1 1 1 1 1 1 1 1 1 1 1 1 1 1 1 1 1 1 1 1 1 1 1 1 1
symmnumber: 1
zpe: 1258442.8 jmol-1
zpe.correction: 0.479316 hartree
zpe.thermalcorrener: 0.504282 hartree
zpe.thermalcorrenthalpy: 0.505226 hartree
zpe.thermalcorrgfe: 0.418850 hartree
zpe.sumelectzpe: -813.229513 hartree
zpe.sumelectthermal: -813.204547 hartree
zpe.sumelectthermalent: -813.203603 hartree
zpe.sumelectthermalfe: -813.289979 hartree
dipole: -0.6661 -2.1477 1.0449
dipole: 2.4796
quadrupole: -132.7138 -123.9851 -120.7163
quadrupole: -15.4613 7.0623 2.0593
quadrupole: -6.9087 1.8199 5.0887 -15.4613 7.0623 2.0593
hfenergy: -813.708829 hartree
pointgroup: C01 [X(C16H34N2O1)]
dipole: 0.2664805 -0.7570445 -0.5545848 debye
polarizability: 267.8746845|-1.9057586|164.508774|3.6132267|3.9508317|154.3481154 unknown
InChI: InChI=1S/C16H34N2O/c1-2-3-4-5-6-7-8-9-10-11-12-13-14-15-16(19)18-17/h18H,2-15,17H2,1H3
charge 0 multiplicity 1
53 atoms
O  -8.130092 0.987729 1.010485
N  -8.996026 -0.505454 -0.54046
N  -10.279669 0.102082 -0.603187
C  2.309922 0.364575 0.009041
C  1.050565 -0.527172 0.093008
C  3.630163 -0.438068 0.041096
C  -0.272369 0.27013 0.044389
C  4.892275 0.450682 -0.032131
C  -1.528211 -0.62452 0.14819
C  6.210563 -0.355409 -0.004729
C  -2.853636 0.165764 0.066785
C  7.474469 0.53148 -0.071958
C  -4.106096 -0.730476 0.195967
C  8.791943 -0.27599 -0.043867
C  -5.427773 0.06044 0.088006
C  10.05648 0.61086 -0.110545
C  -6.674964 -0.845598 0.225476
C  11.367458 -0.204545 -0.078649
C  -7.971471 -0.034754 0.277849
H  2.301444 1.090085 0.849344
H  2.270722 0.968048 -0.922135
H  1.065905 -1.260802 -0.740291
H  1.08562 -1.121785 1.03007
H  3.665414 -1.047466 0.968616
H  3.640617 -1.158634 -0.803589
H  -0.283441 1.013537 0.868739
H  -0.314031 0.85304 -0.899651
H  4.884207 1.168484 0.814843
H  4.856494 1.062922 -0.957718
H  -1.496122 -1.189683 1.103349
H  -1.504304 -1.383236 -0.662211
H  6.219868 -1.070763 -0.853822
H  6.244031 -0.970646 0.918986
H  -2.893325 0.715855 -0.896651
H  -2.872702 0.936344 0.865193
H  7.441751 1.146741 -0.99571
H  7.465402 1.246695 0.777258
H  -4.075421 -1.262211 1.170354
H  -4.075101 -1.515922 -0.588617
H  8.802759 -0.991161 -0.893145
H  8.825861 -0.891392 0.879761
H  -5.464339 0.593587 -0.883357
H  -5.47653 0.836124 0.875188
H  10.022564 1.223522 -1.034739
H  10.043776 1.326685 0.736728
H  -6.600723 -1.412873 1.175194
H  -6.704994 -1.591149 -0.594042
H  11.440972 -0.799372 0.851522
H  12.255953 0.451468 -0.131413
H  11.416004 -0.909095 -0.930534
H  -8.868824 -1.326322 -1.134009
H  -10.197674 1.07165 -0.942553
H  -10.722166 0.093169 0.327376
