program: Gaussian 09
title: 000225487
version: EM64L-G09RevD.01
frameworkgroup: C1[X(C10H8N6O3)]
method: RPBEPBE
basis: SDD
operation: Freq
keyword: #p
keyword: freq=noraman
keyword: PBEPBE/SDD
title: #p freq=noraman PBEPBE/SDD
converged: NO YES NO NO
title: Mulliken charges:
elementType: O O O N N N N N N C C C C C C C C C C H H H H H H H H
charge: -0.204060 -0.217026 -0.211676 -0.497339 -0.436928 0.020841 0.025202 -0.144456 -0.019801 0.505403 -0.420309 -0.298631 0.393260 -0.345160 -0.363155 0.287587 0.119745 -0.212626 -0.261429 0.230198 0.314650 0.288902 0.288310 0.304372 0.334537 0.257991 0.261598
chargesum: 0.00000
title: Mulliken charges with hydrogens summed into heavy atoms:
elementType: O O O N N N N N N C C C C C C C C C C
charge: -0.204060 -0.217026 -0.211676 -0.192966 -0.102391 0.020841 0.025202 -0.144456 -0.019801 0.505403 -0.190112 0.016020 0.393260 -0.056258 -0.074844 0.287587 0.119745 0.045365 0.000169
polarizability: 3.53175280e+02 -3.73897095e+00 1.61396857e+02 1.00930039e-02 -1.01586061e-02 6.23111342e+01
1716.lowfreq: -26.4916 -0.9149 -0.0004 0.0005 0.0007 3.5949 13.1889 26.1498 54.0334
frequency: -26.2311 26.1072 54.0152 57.8736 70.7213 78.4759 132.6648 152.0664 172.9405 190.9556 238.6075 301.0389 336.6439 359.7809 363.8373 402.7409 416.0751 473.7358 505.0160 509.2685 568.6454 580.8322 618.9434 623.5472 666.5629 679.2816 690.6397 718.0679 736.9452 759.0138 775.5225 790.3203 816.4899 833.1881 847.9009 878.8054 889.8617 951.2717 960.0054 978.2811 982.0444 998.9323 1009.9245 1040.4994 1066.2754 1097.8670 1109.6905 1122.3487 1156.1402 1184.0494 1226.8455 1259.9242 1271.7589 1301.5411 1331.5993 1354.5699 1389.2521 1420.2787 1428.8196 1474.9400 1483.7755 1492.8754 1504.5409 1527.0351 1600.5421 1614.8879 1675.3121 3127.2312 3149.2603 3179.8059 3185.9719 3190.9796 3204.5675 3491.4167 3519.8377
redmass: 6.0023 9.1193 11.2105 7.9103 6.5657 5.9971 5.7108 8.7223 4.9924 10.3705 8.0859 4.6692 10.0777 6.9028 5.1767 9.3654 3.0003 2.0671 3.4032 7.3772 1.7664 8.7289 9.4424 7.1728 4.5054 8.7523 2.0773 2.4687 4.6872 8.4901 8.1307 5.5105 7.2861 1.3802 1.2657 1.5008 6.6508 9.5019 1.4873 1.3428 7.1791 3.1182 1.3186 3.3677 6.0697 2.9952 2.4728 1.3342 2.9170 1.4550 4.2588 2.5657 2.0399 1.4168 1.6880 6.7254 5.7804 2.3773 4.7574 3.9942 4.4340 2.8639 2.1743 2.2654 5.8150 5.9738 5.2628 1.0907 1.0916 1.0908 1.0946 1.0972 1.0958 1.0757 1.0762
irintensity: 4.7120 0.1632 4.5526 0.7742 1.6850 1.0654 1.8745 8.3688 11.0410 0.0921 7.2911 2.3650 0.4999 2.5600 6.5858 8.0939 0.0569 17.9640 9.5674 1.4981 3.7374 0.2856 1.2774 1.6851 17.1836 4.4130 45.9593 111.1204 11.4428 34.0956 8.2034 13.4934 0.7487 32.5158 40.3317 74.5531 9.9036 42.9276 0.3381 0.8647 27.7724 1.0477 0.2396 45.1488 216.2083 29.2590 0.7539 26.8794 726.7495 82.0342 492.0537 24.2013 81.5076 66.4310 8.9283 121.2878 373.6912 55.6240 25.5808 919.9157 161.3388 168.4224 723.6142 18.6862 53.9123 150.7259 130.5113 13.5255 13.6426 2.2930 3.1933 9.6833 5.8897 25.0945 24.2853
temp: 298.150 k
press: 1.00000 atm
elementType: 8 8 8 7 7 7 7 7 7 6 6 6 6 6 6 6 6 6 6 1 1 1 1 1 1 1 1
symmnumber: 1
zpe: 486772.6 jmol-1
zpe.correction: 0.185402 hartree
zpe.thermalcorrener: 0.200436 hartree
zpe.thermalcorrenthalpy: 0.201380 hartree
zpe.thermalcorrgfe: 0.141120 hartree
zpe.sumelectzpe: -938.591570 hartree
zpe.sumelectthermal: -938.576536 hartree
zpe.sumelectthermalent: -938.575592 hartree
zpe.sumelectthermalfe: -938.635853 hartree
dipole: -6.3071 -2.2585 -0.0002
dipole: 6.6993
quadrupole: -143.9225 -105.1808 -109.6245
quadrupole: -20.3001 0.0007 0.0035
quadrupole: -24.3466 14.3951 9.9515 -20.3001 0.0007 0.0035
hfenergy: -938.7769722 hartree
pointgroup: C01 [X(C10H8N6O3)]
dipole: -2.4872956 0.8719515 0.0000932 debye
polarizability: 353.1166991|5.0210572|161.4554376|-0.0100248|-0.0102259|62.3111342 unknown
InChI: InChI=1S/C10H8N6O3/c17-10(14-9-11-5-6-12-15-9)13-7-1-3-8(4-2-7)16(18)19/h1-6,13-14H
charge 0 multiplicity 1
27 atoms
O  -1.02436 -1.30008 0.000585
O  6.372458 0.757082 -0.000673
O  5.968048 -1.489843 -0.000288
N  -0.021922 0.837263 0.000487
N  -2.343566 0.670824 0.000502
N  5.571211 -0.259334 -0.000828
N  -3.929467 -1.153303 0.00035
N  -4.577522 1.225177 -0.000151
N  -5.900842 0.9045 -0.000465
C  1.35286 0.500954 0.00017
C  2.281991 1.582687 -0.00021
C  1.831842 -0.840466 0.000224
C  4.119854 0.002987 -0.000479
C  3.662454 1.340427 -0.000528
C  3.215953 -1.082304 -0.000098
C  -1.120418 -0.052028 0.000838
C  -3.648911 0.182034 0.000245
C  -5.25999 -1.443093 0.000026
C  -6.24479 -0.428358 -0.000382
H  1.91741 2.61733 -0.000255
H  1.119632 -1.666211 0.00052
H  4.388862 2.156769 -0.000825
H  3.607552 -2.102869 -0.000067
H  -0.21639 1.841588 0.000401
H  -2.33839 1.696826 0.000335
H  -5.52395 -2.505658 0.00011
H  -7.316409 -0.638403 -0.000647
