program: Gaussian 09
title: 000225493
version: EM64L-G09RevD.01
frameworkgroup: C1[X(C11H15NO4S)]
method: RPBEPBE
basis: SDD
operation: Freq
keyword: #p
keyword: freq=noraman
keyword: PBEPBE/SDD
title: #p freq=noraman PBEPBE/SDD
converged: YES YES NO NO
title: Mulliken charges:
elementType: S O O O O N C C C C C C C C C C C H H H H H H H H H H H H H H H
charge: 0.947580 -0.547963 -0.520355 -0.438076 -0.249825 -0.560214 -0.580482 -0.294030 -0.342303 0.410489 -0.683646 -0.432532 -0.366666 0.276619 -0.181191 -0.340256 0.121857 0.276053 0.271311 0.230645 0.231127 0.201973 0.204805 0.298756 0.217832 0.222888 0.216547 0.270837 0.236194 0.236508 0.279047 0.386471
chargesum: 0.00000
title: Mulliken charges with hydrogens summed into heavy atoms:
elementType: S O O O O N C C C C C C C C C C C
charge: 0.947580 -0.547963 -0.520355 -0.051604 -0.249825 -0.261458 -0.033118 0.167743 0.064475 0.410489 -0.026380 -0.161694 -0.130472 0.276619 0.055317 -0.061210 0.121857
polarizability: 2.70164953e+02 1.40354865e+00 1.85035164e+02 6.80133727e+00 2.63519730e+00 1.04981338e+02
1716.lowfreq: -22.6214 -6.7439 -5.3485 -0.0009 0.0019 0.0020 4.7943 13.5309 26.2292
frequency: -19.2517 13.3350 26.1558 47.9317 62.6357 67.4042 84.7638 102.7315 145.6806 153.7083 163.1771 181.2026 204.9249 217.2875 229.1155 248.9830 300.2128 343.9840 364.2683 388.5135 407.3967 421.7063 454.2718 498.6494 524.8590 562.2181 593.9901 599.9436 615.6094 683.9427 714.2721 731.3098 745.5595 785.3404 812.2901 814.6203 847.9445 893.2757 894.2540 903.1355 926.7615 936.0556 952.3923 986.4124 994.8890 1024.8926 1044.0116 1063.0142 1077.5563 1093.2751 1100.8881 1129.3402 1182.4317 1199.4261 1221.9843 1228.8384 1233.1422 1273.9729 1294.9042 1304.8315 1307.3473 1324.5645 1343.6722 1393.5269 1399.5461 1407.4687 1450.9761 1466.1377 1471.8008 1477.5061 1478.0418 1489.1677 1577.5636 1610.2630 1644.9717 2976.8839 2980.8293 2999.4375 3023.8367 3049.4513 3062.6434 3080.5995 3081.8296 3127.8226 3139.7583 3156.1627 3167.0937 3186.2524 3345.8966 3532.2445
redmass: 2.3268 5.7090 5.1727 6.9161 3.0342 4.7959 5.7919 2.2233 6.1256 5.2359 7.2143 6.4089 4.8778 4.6420 1.4119 2.1548 6.0336 6.1064 7.2245 4.1373 4.3885 3.1466 7.2483 4.5603 3.3344 4.6320 4.6820 4.2953 1.6349 2.1394 4.9882 4.7579 1.0710 1.2065 5.6973 1.7504 1.7208 2.3200 1.8690 2.2794 1.4490 1.5863 2.2432 5.9457 1.3729 3.7318 2.5912 2.6888 1.2962 1.7034 2.2409 1.5508 1.1038 1.5249 1.5620 1.8287 1.2780 1.2085 1.0627 1.3874 1.3207 2.5686 1.4301 1.2040 7.2717 1.1097 2.7668 2.5719 1.0654 1.0650 1.0419 1.0851 6.3807 6.2097 8.7969 1.0577 1.0371 1.0590 1.1015 1.0559 1.1041 1.1016 1.0995 1.0891 1.1101 1.0933 1.0922 1.0963 1.0745 1.0642
irintensity: 0.6880 3.4929 1.4806 1.1401 1.4883 0.2240 0.6084 0.0258 9.1083 5.0944 0.2242 11.7019 1.6259 11.8816 0.5582 0.9989 10.3053 11.6766 7.2502 49.5425 13.4226 10.8894 72.1961 16.6196 11.6981 13.4868 56.5965 8.5759 127.8568 4.6182 19.1899 46.8524 9.7747 0.6673 92.4238 4.4155 169.6652 5.8279 5.4484 28.6873 1.7128 8.4227 48.2914 4.6470 0.7873 3.9361 227.1527 5.1096 3.0218 17.0318 31.1717 121.0630 1.7807 0.2934 18.7154 1.9352 0.8110 0.4812 1.3593 23.7378 32.2930 105.9454 14.4550 5.9283 1.7357 7.7502 38.4716 3.7573 2.5701 1.8060 13.3199 20.0299 26.0539 8.7959 204.2480 27.3127 33.4129 18.4878 7.6205 8.8981 2.6385 61.8873 41.0938 5.5987 3.5968 16.1990 2.2687 3.3639 13.2291 50.9998
temp: 298.150 k
press: 1.00000 atm
elementType: 16 8 8 8 8 7 6 6 6 6 6 6 6 6 6 6 6 1 1 1 1 1 1 1 1 1 1 1 1 1 1 1
symmnumber: 1
zpe: 645223.3 jmol-1
zpe.correction: 0.245753 hartree
zpe.thermalcorrener: 0.263814 hartree
zpe.thermalcorrenthalpy: 0.264758 hartree
zpe.thermalcorrgfe: 0.196803 hartree
zpe.sumelectzpe: -1180.434881 hartree
zpe.sumelectthermal: -1180.416819 hartree
zpe.sumelectthermalent: -1180.415875 hartree
zpe.sumelectthermalfe: -1180.483831 hartree
dipole: 0.6478 0.7362 -2.6643
dipole: 2.8390
quadrupole: -86.1205 -107.0865 -115.7503
quadrupole: -10.6030 7.2691 5.9055
quadrupole: 16.8652 -4.1007 -12.7645 -10.6030 7.2691 5.9055
hfenergy: -1180.6806332 hartree
pointgroup: C01 [X(C11H15N1O4S1)]
dipole: 0.1448633 1.1069453 0.035672 debye
polarizability: 269.4373822|11.5626964|108.3006871|-5.2997811|14.5575048|182.4433864 unknown
InChI: InChI=1S/C11H15NO4S/c1-2-3-7-17(15,16)12-10-6-4-5-9(8-10)11(13)14/h4-6,8,12-13H,2-3,7H2,1H3
charge 0 multiplicity 1
32 atoms
S  -1.780931 -0.424165 -1.109323
O  -2.683958 -0.926386 -2.372802
O  -0.98499 -1.484499 -0.164794
O  4.397278 0.856547 1.802004
O  2.254318 1.420111 2.495156
N  -0.518979 0.950089 -1.842206
C  -2.872157 0.696928 0.02168
C  -3.982671 -0.134114 0.663452
C  -4.860629 0.75129 1.587456
C  0.848519 0.733179 -1.514881
C  -5.988409 -0.066681 2.25343
C  1.278069 0.960978 -0.183081
C  1.804583 0.338569 -2.495596
C  2.639593 0.806573 0.159991
C  3.167037 0.215363 -2.152885
C  3.592707 0.437207 -0.825768
C  3.02735 1.060527 1.574784
H  -3.228021 1.476567 -0.670581
H  -2.145029 1.108214 0.740344
H  -4.613964 -0.58952 -0.123179
H  -3.540364 -0.95848 1.254579
H  -5.299307 1.581524 0.998928
H  -4.22537 1.214514 2.368357
H  -0.708164 0.838905 -2.859071
H  -5.573202 -0.889826 2.863681
H  -6.602865 0.569777 2.915235
H  -6.657494 -0.513087 1.494877
H  0.567142 1.270952 0.588933
H  1.473998 0.137279 -3.522272
H  3.894389 -0.072095 -2.918972
H  4.642536 0.327377 -0.542569
H  4.592485 1.036082 2.760593
