program: Gaussian 09
title: 000225475
version: EM64L-G09RevD.01
frameworkgroup: C1[X(C8H6N2O7)]
method: RPBEPBE
basis: SDD
operation: Freq
keyword: #pfreq=noraman
keyword: PBEPBE/SDD
title: #p freq=noraman PBEPBE/SDD
converged: YES YES NO NO
title: Mulliken charges:
elementType: O O O O O O O N N C C C C C C C C H H H H H H
charge: -0.356529 -0.307887 -0.213371 -0.271956 -0.110300 -0.151436 -0.261678 0.026006 0.023655 0.326704 -0.022515 0.246809 0.374473 0.006406 -0.573192 0.144524 -0.732735 0.342342 0.252560 0.253756 0.252481 0.372866 0.379015
chargesum: 0.00000
title: Mulliken charges with hydrogens summed into heavy atoms:
elementType: O O O O O O O N N C C C C C C C C
charge: 0.016337 0.071128 -0.213371 -0.271956 -0.110300 -0.151436 -0.261678 0.026006 0.023655 0.326704 -0.022515 0.246809 0.374473 0.006406 -0.230849 0.144524 0.026062
polarizability: 1.99106688e+02 7.11565398e+00 1.88004551e+02 -6.46017914e-02 8.91089597e-02 5.27722040e+01
1716.lowfreq: -0.0012 -0.0010 -0.0009 1.7598 5.3358 9.0575 29.8163 36.2963 58.7081
frequency: 29.7964 36.2821 58.7058 98.7608 116.1534 146.2319 162.8207 204.8420 212.7544 282.3883 310.1343 319.6183 323.2072 351.2229 372.4400 385.8442 411.8657 451.7822 466.2265 480.9160 567.2435 575.1450 631.7685 660.3170 686.4021 700.6257 704.0917 706.6040 738.8026 741.1905 815.3125 862.1786 964.8856 975.7869 993.1978 999.6842 1035.4233 1045.8678 1057.0577 1096.8676 1143.2663 1208.8382 1221.7573 1278.8895 1319.0733 1337.0534 1366.8138 1381.3108 1386.7767 1423.2162 1437.2573 1445.9744 1484.9912 1502.3596 1576.4945 1589.8475 1623.5085 2437.7030 2588.9228 2998.9187 3083.2166 3129.5878 3151.2659
redmass: 4.5450 10.6307 10.8214 10.5947 14.3414 8.3920 7.6241 1.0438 9.9788 7.9978 5.7835 8.0471 8.7553 6.7689 11.4479 6.6370 6.4070 11.2480 4.2027 8.4459 4.4685 3.4727 12.2425 11.9801 8.9275 4.8127 10.8120 9.2970 7.4000 9.7351 8.3008 9.6477 1.0669 2.0544 1.2924 1.1105 1.7732 5.9116 3.3108 8.5132 5.2459 3.6587 2.5507 3.2393 3.9645 5.0403 7.0089 1.2762 8.6826 1.4925 2.0126 1.0480 2.0935 4.8542 6.2176 2.8860 6.7889 1.0722 1.0704 1.0365 1.0950 1.1024 1.0913
irintensity: 5.4461 0.0953 0.2008 1.9184 0.3234 3.4143 2.0267 0.9108 8.8941 0.0031 7.7541 1.5287 1.2470 2.2003 7.5362 11.2312 12.0337 0.3675 1.8072 5.2077 41.6495 2.7333 2.8129 25.1645 0.2427 4.2183 6.8318 0.6609 5.5229 8.9143 3.7098 36.7126 106.4604 8.4456 127.2101 50.2971 0.2998 66.8816 44.8696 224.5438 228.0687 168.4231 14.8882 48.9539 169.3021 198.8036 214.0457 42.2255 9.8753 224.1381 94.3968 20.1543 110.8908 50.7869 269.8091 219.6943 319.1801 483.9801 373.8719 0.2827 4.9618 19.2370 23.7281
temp: 298.150 k
press: 1.00000 atm
elementType: 8 8 8 8 8 8 8 7 7 6 6 6 6 6 6 6 6 1 1 1 1 1 1
symmnumber: 1
zpe: 376210.5 jmol-1
zpe.correction: 0.143291 hartree
zpe.thermalcorrener: 0.158030 hartree
zpe.thermalcorrenthalpy: 0.158974 hartree
zpe.thermalcorrgfe: 0.100067 hartree
zpe.sumelectzpe: -943.121088 hartree
zpe.sumelectthermal: -943.106349 hartree
zpe.sumelectthermalent: -943.105405 hartree
zpe.sumelectthermalfe: -943.164312 hartree
dipole: 2.1878 0.9912 0.0267
dipole: 2.4020
quadrupole: -102.1014 -125.4011 -93.3215
quadrupole: 3.4767 0.1017 -0.0609
quadrupole: 4.8399 -18.4598 13.6198 3.4767 0.1017 -0.0609
hfenergy: -943.2643789 hartree
pointgroup: C01 [X(C8H6N2O7)]
dipole: -0.8640843 -0.3169951 0.2143886 debye
dipolederiv: -0.9483539 -0.2888804 0.1675105 -0.3438563 -0.8723693 0.2182892 0.1847175 0.2117619 -0.3953103 -1.0609248 0.1194872 0.0517806 0.1779787 -0.4867317 0.0352013 0.0331634 0.0421462 -0.3250246 -0.6429208 0.1232374 0.003915 0.3665389 -0.8804109 0.1419706 -0.0735572 0.1699574 -0.3492983 -0.7579147 -0.1617788 0.1070687 -0.1381321 -0.66969 0.1393366 0.0998511 0.1419485 -0.3341515 -0.4915514 0.3446315 -0.0688796 0.2234237 -0.6372009 0.125086 -0.0310996 0.1113741 -0.1867488 -0.361719 -0.0478345 0.0357355 -0.337853 -0.901789 0.2673311 0.127309 0.2320337 -0.2741857 -0.9961302 0.0103322 0.0824477 0.2253317 -0.5061452 0.0483378 0.0135504 0.0737843 -0.2950002 0.9856973 -0.1183953 -0.0531317 0.0182595 1.7038924 -0.4714086 -0.096216 -0.4564678 0.3646656 1.6596663 0.4429894 -0.3105262 0.5425775 1.3236234 -0.4182469 -0.3416182 -0.4055335 0.3780286 -1.0109998 0.1144048 0.0804085 -0.3659336 -0.6952633 0.247107 0.2339288 0.1897329 -0.1367104 0.8650189 0.0022653 -0.0883631 0.4637386 1.0195648 -0.3341306 -0.2324673 -0.2800828 0.246556 -0.5978118 -0.0121972 0.074586 -0.0136362 -0.9320716 0.293886 0.0754882 0.2937248 -0.1022728 -1.0191298 -0.3298297 0.2258801 0.0341575 -0.6869865 0.2148532 0.111215 0.2581731 -0.0865862 0.9669452 0.1194516 -0.132418 -0.1174617 0.8625482 -0.2060469 -0.0584165 -0.234719 0.2439928 0.915207 0.1961653 -0.172282 0.0524816 -0.0312066 -0.0005345 -0.128854 -0.0165344 0.007194 1.5969704 -0.3993134 -0.0562507 -0.5573194 0.9623839 -0.1990907 -0.0058672 -0.2164993 0.2088429 -0.4205935 -0.1234506 0.0955069 -0.2317504 -0.0810937 0.0610242 0.1297881 0.0472974 -0.0141417 0.1925033 -0.0287438 0.0049079 -0.0336105 0.1569572 0.0039546 0.006666 0.003344 0.1557029 0.1082523 -0.0059794 -0.0455231 -0.0082372 0.1229704 0.0493594 -0.0284716 0.0435748 -0.0358419 0.1209686 -0.0059363 0.0197836 -0.0196249 0.026344 -0.0935549 0.007584 -0.0893601 0.0528311 -0.0299049 0.0674571 -0.0024261 0.1529408 0.0010231 0.0197785 -0.0297186 0.0304148 0.1158717 0.4451027 -0.1156415 0.0253779 -0.0814587 0.666135 -0.0886462 0.0144412 -0.0839493 0.3778599 0.4816224 0.0975591 -0.0451086 -0.0085546 0.5355163 -0.0538564 -0.0114167 -0.0661215 0.3837269 unknown
polarizability: 197.5995361|1.4900131|175.1694671|-17.7723499|-38.7618322|67.1144401 unknown
InChI: InChI=1S/C8H6N2O7/c1-3(11)4-2-5(9(14)15)8(13)6(7(4)12)10(16)17/h2,12-13H,1H3
charge 0 multiplicity 1
23 atoms
O  -2.17825 -0.951353 0.591342
O  2.65697 -0.892945 -0.000348
O  -2.296062 3.090975 -0.672496
O  -0.858985 -2.95265 1.061035
O  1.393201 -3.007361 0.814339
O  2.393099 3.07147 -1.221143
O  3.680195 1.240527 -0.791441
N  0.303205 -2.360398 0.738742
N  2.49862 1.855323 -0.848688
C  -1.120677 1.072545 -0.170577
C  -1.042951 -0.298586 0.25114
C  0.246584 -0.969164 0.30826
C  1.31947 1.093003 -0.468066
C  1.454681 -0.280988 -0.051093
C  0.067289 1.729649 -0.519347
C  -2.396992 1.894232 -0.274428
C  -3.744396 1.307137 0.086628
H  -0.003398 2.775364 -0.840271
H  -3.75686 0.955893 1.133773
H  -3.969701 0.417884 -0.528168
H  -4.514597 2.078889 -0.064118
H  -1.888429 -1.93629 0.866417
H  3.365384 -0.179855 -0.307892
