program: Gaussian 09
title: 000225465
version: EM64L-G09RevD.01
frameworkgroup: C1[X(C10H8N2O)]
method: RPBEPBE
basis: SDD
operation: Freq
keyword: #p
keyword: freq=noraman
keyword: PBEPBE/SDD
title: #p freq=noraman PBEPBE/SDD
converged: YES YES NO YES
title: Mulliken charges:
elementType: O N N C C C C C C C C C C H H H H H H H H
charge: -0.317676 -0.652832 0.003044 0.273052 0.448112 0.253623 -0.468977 -0.070051 -0.342295 -0.424899 -0.316638 -0.265348 -0.228984 0.242973 0.205176 0.247053 0.257667 0.235761 0.235310 0.370279 0.315649
chargesum: 0.00000
title: Mulliken charges with hydrogens summed into heavy atoms:
elementType: O N N C C C C C C C C C C
charge: -0.317676 0.033096 0.003044 0.273052 0.448112 0.253623 -0.226004 -0.070051 -0.137119 -0.177846 -0.058971 -0.029588 0.006327
polarizability: 2.16289723e+02 -3.21897196e+00 1.40961393e+02 -2.82105511e-03 -9.82695906e-04 4.87952234e+01
1716.lowfreq: -13.3007 -10.2400 0.0003 0.0006 0.0009 5.7558 85.2015 109.1655 216.5063
frequency: 85.1959 109.1592 216.5062 240.7432 252.8123 316.9073 356.1545 367.8156 415.2906 457.9127 475.8481 493.9292 555.0592 558.5128 600.6326 618.8352 683.7556 688.9228 747.2111 753.2421 803.3402 822.5690 866.8600 885.9690 901.7762 925.4171 955.1490 980.4198 996.6346 1035.8645 1096.6086 1134.0425 1156.5039 1179.8721 1198.4928 1212.0064 1235.9984 1265.2701 1290.4434 1395.8850 1412.5986 1418.7040 1454.1456 1468.1406 1502.5563 1546.6475 1584.9156 1614.7365 1625.5315 3072.2249 3116.5842 3130.7140 3142.3980 3148.2689 3167.4597 3168.6988 3604.3380
redmass: 6.6938 3.9004 5.5782 6.6359 4.7480 3.5283 4.0291 8.6064 2.8831 4.3349 2.7362 6.2709 7.3148 2.1692 2.0656 6.7276 3.4460 6.2002 6.5226 1.2959 2.7932 1.4388 4.0907 1.7564 3.4560 1.1480 1.3821 1.3294 1.3695 2.3624 2.1694 2.2595 1.4939 1.1749 3.1256 2.9730 1.8694 1.7031 1.9859 5.6682 2.7270 2.2938 2.9000 3.4475 2.3631 3.8971 2.3355 6.2968 6.4733 1.0693 1.0875 1.0876 1.0875 1.0939 1.1000 1.0981 1.0846
irintensity: 2.5328 0.5304 2.8844 3.8717 3.1562 3.7018 6.7160 2.0531 3.3171 2.3022 15.1343 0.9255 8.1043 12.0663 90.1329 7.6410 0.1881 0.8351 12.0656 38.5409 1.8326 95.7593 4.9407 10.2669 1.7800 135.3046 7.5989 0.0091 0.9709 5.3648 30.8330 153.7553 10.3876 7.8823 22.8326 154.9497 42.9090 9.5633 1.8102 33.6969 5.7499 9.6755 4.6986 58.5814 5.0206 62.5625 212.6878 30.9333 87.7461 68.4982 9.3215 0.7213 1.7472 23.8738 27.8997 10.9108 31.2070
temp: 298.150 k
press: 1.00000 atm
elementType: 8 7 7 6 6 6 6 6 6 6 6 6 6 1 1 1 1 1 1 1 1
symmnumber: 1
zpe: 415775.5 jmol-1
zpe.correction: 0.158361 hartree
zpe.thermalcorrener: 0.168147 hartree
zpe.thermalcorrenthalpy: 0.169091 hartree
zpe.thermalcorrgfe: 0.123307 hartree
zpe.sumelectzpe: -569.654870 hartree
zpe.sumelectthermal: -569.645084 hartree
zpe.sumelectthermalent: -569.644139 hartree
zpe.sumelectthermalfe: -569.689924 hartree
dipole: 5.6399 -1.6898 0.0020
dipole: 5.8876
quadrupole: -86.7728 -60.0162 -79.6326
quadrupole: 1.6055 -0.0099 -0.0027
quadrupole: -11.2989 15.4576 -4.1587 1.6055 -0.0099 -0.0027
hfenergy: -569.8132304 hartree
pointgroup: C01 [X(C10H8N2O1)]
dipole: 2.2652346 -0.4795161 0.0655805 debye
dipolederiv: -0.8403954 0.0172612 -0.0162924 -1.2189437 -0.5307427 -0.0318916 -0.0090481 0.0022981 -0.2499747 -0.3424744 -0.2924735 0.0075106 -0.1791048 -1.0436873 -0.001568 0.006771 -0.0047747 -0.55005 1.3900317 0.0645375 0.0430327 0.9401525 0.1568147 0.0238661 0.0381749 -0.0003644 -0.1829167 -0.2068697 -0.388914 -0.0018594 0.0862111 -0.1528977 0.003026 -0.0047401 -0.0098545 -0.0463073 0.4863615 -0.2103084 0.0120056 -0.3433581 0.104576 -0.0094211 0.0126734 -0.0057537 0.0936818 0.6149534 0.4557937 0.008537 -0.03639 0.8975969 -0.0056845 0.0116426 0.007868 0.1935576 -0.5962957 0.1135106 -0.0106821 0.1014073 0.0257033 0.0011486 -0.0105354 0.0014542 -0.2333356 -1.2039457 0.1363029 -0.0348711 0.0611155 -0.1816597 0.0031095 -0.034801 0.005064 0.0327277 0.0064451 0.1733686 0.0027892 -0.0854758 0.0196162 -0.0033824 0.0044899 0.0036457 -0.1390077 -0.3594718 0.1772833 -0.0062995 0.1960378 0.1042958 0.0035931 -0.0063642 0.0030415 -0.1709011 0.4339946 -0.0507079 0.014725 0.4403372 0.1927503 0.0102844 0.0118322 -0.0031179 -0.0944467 -0.0350383 -0.2178457 0.0048683 -0.0477087 -0.061932 -0.001941 0.0037575 -0.0065532 -0.1633329 0.18516 0.0427247 0.0084435 -0.0837182 0.1257923 -0.0039695 0.0092926 -0.0005148 -0.1359939 0.0459732 -0.0906487 -0.0026397 -0.0220798 -0.0755155 0.0008827 -0.003046 -0.0009915 0.1639933 0.0690025 -0.1033967 -0.0014739 -0.0267502 -0.105201 0.0009247 -0.0019811 -0.0011655 0.1484832 0.0687686 -0.009376 -0.0023225 -0.0759973 -0.0874963 -0.0005107 -0.0018854 0.0012819 0.1568322 0.0399294 0.1052607 -0.0037735 0.0352825 0.032738 0.0016976 -0.0033528 0.0036408 0.1547343 -0.0185273 0.0934907 -0.0055582 0.1143534 -0.0193908 0.0042791 -0.0057041 0.0037239 0.1644877 -0.1175627 -0.0465721 -0.0072126 -0.0492292 0.0869998 -0.0008716 -0.0072217 -0.000799 0.1593344 0.2013607 -0.0784177 -0.0040472 0.1160749 0.2752688 0.0037153 -0.0053292 -0.001716 0.366274 0.1786002 0.1091269 -0.0048799 0.0777838 0.236371 0.0027132 -0.0046251 0.0035871 0.3321601 unknown
polarizability: 216.1830328|3.0309261|140.9410303|4.5458296|-0.4934166|48.9222758 unknown
InChI: InChI=1S/C10H8N2O/c11-10-8-4-2-1-3-7(8)5-6-9(10)12-13/h1-6H,11H2
charge 0 multiplicity 1
21 atoms
O  -3.656918 -1.050043 -0.113158
N  -1.28793 -2.043488 -0.040991
N  -3.176934 0.183577 -0.107254
C  0.611861 -0.450951 0.000743
C  1.0220 0.933579 0.003053
C  -0.813321 -0.763982 -0.036129
C  0.035111 1.989827 -0.030217
C  -1.771622 0.320312 -0.069093
C  1.612781 -1.470786 0.034402
C  2.418736 1.235794 0.038888
C  -1.311766 1.686337 -0.064888
C  2.974775 -1.147706 0.069115
C  3.380328 0.218988 0.07133
H  0.376684 3.03001 -0.027407
H  1.331054 -2.530699 0.033649
H  2.728217 2.287243 0.040592
H  -2.085396 2.460442 -0.090733
H  3.727605 -1.942104 0.094567
H  4.44614 0.469833 0.098626
H  -2.332499 -2.114194 -0.069098
H  -0.668104 -2.851088 -0.018995
