program: Gaussian 09
title: 000225459
version: EM64L-G09RevD.01
frameworkgroup: C1[X(C12H14N2O3)]
method: RPBEPBE
basis: SDD
operation: Freq
keyword: #p
keyword: freq=noraman
keyword: PBEPBE/SDD
title: #p freq=noraman PBEPBE/SDD
converged: YES YES NO NO
title: Mulliken charges:
elementType: O O O N N C C C C C C C C C C C C H H H H H H H H H H H H H H
charge: -0.278257 -0.203094 -0.209143 -0.123228 0.020607 -0.405855 -0.375555 -0.373581 -0.390050 -0.415019 0.133725 0.309828 -0.467236 -0.374421 0.367934 -0.187759 -0.362802 0.193703 0.227954 0.213714 0.207629 0.209552 0.210826 0.269682 0.210073 0.226765 0.250707 0.302981 0.276578 0.243850 0.289891
chargesum: 0.00000
title: Mulliken charges with hydrogens summed into heavy atoms:
elementType: O O O N N C C C C C C C C C C C C
charge: -0.278257 -0.203094 -0.209143 -0.123228 0.020607 0.015802 0.045788 0.046797 0.089705 0.062453 0.133725 0.309828 -0.164256 -0.097842 0.367934 0.056092 -0.072911
polarizability: 2.05559461e+02 1.04170948e+00 1.70969343e+02 6.79766685e+00 4.60306461e+00 9.27342762e+01
1716.lowfreq: -3.9233 -0.0010 -0.0010 -0.0009 5.3410 10.5472 38.0636 46.6935 52.8332
frequency: 37.7384 46.6782 52.8246 73.6030 88.8537 151.5897 173.2988 186.5467 253.3232 276.5613 286.4522 315.2261 341.7738 390.3108 403.3306 422.8536 435.9699 451.0046 501.6964 513.0060 569.6703 627.3760 653.7679 660.4564 698.1327 715.4992 733.5659 799.8959 804.7968 827.5815 833.2576 851.2349 886.8943 922.4600 942.8676 951.4221 961.7556 989.5066 1001.2411 1003.8145 1039.0782 1079.9846 1087.7272 1089.5233 1112.8576 1122.4933 1155.6156 1165.8057 1176.5735 1213.0470 1229.6423 1254.1344 1262.0785 1271.5951 1287.4638 1327.6457 1340.8170 1347.7942 1347.8816 1357.5584 1370.3126 1390.9074 1413.2408 1427.5913 1454.0471 1463.4003 1469.6365 1474.3673 1477.1697 1485.0744 1549.9137 1585.5346 1612.4843 2947.2156 2960.5198 2972.3747 2985.9870 2990.9527 3042.4468 3049.2600 3058.2123 3092.2374 3097.0755 3152.3393 3170.6569 3175.2602 3187.6750
redmass: 5.7138 4.3151 8.3512 4.8751 4.4138 7.1922 4.2898 3.1575 2.6707 3.4551 4.9352 2.8028 7.0650 5.8588 2.1204 2.9580 3.3107 3.2008 7.9923 2.3309 3.7626 4.4130 5.9325 5.8689 2.3568 7.3349 6.2685 4.0078 1.6599 1.6114 2.9009 1.4977 2.9171 2.8480 1.4684 1.3753 1.3801 6.0392 2.4899 1.3852 2.0549 1.5981 1.8259 1.4967 2.0767 2.5602 1.2530 2.1408 1.2534 5.5730 2.5766 1.3954 1.6878 1.1913 1.3386 1.2676 1.3627 1.5117 1.4478 1.3616 9.6443 6.7638 3.0806 3.1679 1.0956 1.0885 1.1294 1.8241 1.2820 1.1486 7.7232 6.8477 7.0768 1.0717 1.0697 1.0645 1.0614 1.0612 1.0959 1.1021 1.1031 1.0932 1.0909 1.0880 1.0941 1.0920 1.0972
irintensity: 3.5278 0.9888 0.6443 2.7544 2.2459 2.4356 0.6499 3.6870 0.5991 0.7517 1.0297 0.3865 11.8509 1.9746 1.6892 3.1978 1.6989 3.7538 0.7217 6.1698 1.6035 8.6761 10.3244 4.5657 49.8263 15.4253 4.5676 5.6637 1.7517 30.9875 3.7817 14.5544 7.8863 3.8091 10.3805 6.4034 17.1355 0.7210 39.0932 1.9428 3.8948 34.4699 19.0819 8.7283 20.0380 3.9957 0.4804 3.7901 18.5435 248.5901 35.0006 44.0364 85.1441 15.6509 5.9956 1.3652 0.9346 7.8683 5.0444 6.7175 103.5179 12.7700 157.1072 8.6477 8.3635 13.3746 17.4891 3.8636 10.6064 13.2392 233.3944 39.0130 3.5325 34.8198 53.5699 39.5837 24.6367 31.6391 53.5409 29.6172 81.2260 8.5393 18.0576 5.3269 4.4539 1.7518 4.0398
temp: 298.150 k
press: 1.00000 atm
elementType: 8 8 8 7 7 6 6 6 6 6 6 6 6 6 6 6 6 1 1 1 1 1 1 1 1 1 1 1 1 1 1
symmnumber: 1
zpe: 646958.7 jmol-1
zpe.correction: 0.246414 hartree
zpe.thermalcorrener: 0.261211 hartree
zpe.thermalcorrenthalpy: 0.262155 hartree
zpe.thermalcorrgfe: 0.203282 hartree
zpe.sumelectzpe: -799.528311 hartree
zpe.sumelectthermal: -799.513514 hartree
zpe.sumelectthermalent: -799.512570 hartree
zpe.sumelectthermalfe: -799.571443 hartree
dipole: -3.0177 0.7585 2.9285
dipole: 4.2729
quadrupole: -97.3035 -110.5874 -100.0004
quadrupole: 20.8611 0.5942 3.8930
quadrupole: 5.3269 -7.9569 2.6300 20.8611 0.5942 3.8930
hfenergy: -799.774725 hartree
pointgroup: C01 [X(C12H14N2O3)]
dipole: 1.2454558 -0.3458883 1.0748527 debye
polarizability: 204.6663802|3.0186708|171.3717401|-11.2087022|1.5538712|93.2249596 unknown
InChI: InChI=1S/C12H14N2O3/c15-12(13-7-2-1-3-8-13)10-5-4-6-11(9-10)14(16)17/h4-6,9H,1-3,7-8H2
charge 0 multiplicity 1
31 atoms
O  1.513017 -2.352968 -1.00059
O  -4.260639 1.51776 0.303381
O  -2.258607 2.496674 -0.179857
N  2.115827 -0.446654 0.203054
N  -2.986785 1.467173 0.102182
C  3.830409 1.91523 0.379406
C  3.995279 0.866918 -0.747178
C  2.37604 1.931631 0.909489
C  3.513148 -0.528188 -0.289859
C  1.932951 0.509431 1.321559
C  1.185045 -1.367224 -0.259578
C  -0.276325 -1.174669 0.085484
C  -0.922856 0.078739 -0.007477
C  -1.046486 -2.333558 0.367467
C  -2.31506 0.146156 0.208416
C  -2.436898 -2.239951 0.593932
C  -3.090291 -0.991807 0.516956
H  4.51866 1.666453 1.213976
H  4.117402 2.919575 0.016718
H  3.410083 1.175041 -1.635209
H  5.054639 0.797512 -1.059139
H  2.287744 2.606532 1.781861
H  1.695069 2.317674 0.125559
H  3.537175 -1.265516 -1.107566
H  4.163834 -0.904277 0.528147
H  2.563099 0.16615 2.171094
H  0.888172 0.495159 1.665116
H  -0.382643 0.991538 -0.272268
H  -0.539253 -3.303353 0.382121
H  -3.014752 -3.141581 0.81954
H  -4.166296 -0.885599 0.677064
