program: Gaussian 09
title: 000225455
version: EM64L-G09RevD.01
frameworkgroup: C1[X(C11H14ClNO2)]
method: RPBEPBE
basis: SDD
operation: Freq
keyword: #p
keyword: freq=noraman
keyword: PBEPBE/SDD
title: #p freq=noraman PBEPBE/SDD
converged: NO YES NO NO
title: Mulliken charges:
elementType: Cl O O N C C C C C C C C C C C H H H H H H H H H H H H H H
charge: -0.080055 -0.238393 -0.426084 -0.257968 -0.328283 -0.333564 -0.479853 -0.323786 -0.321448 0.343576 0.095002 -0.401297 -0.336990 -0.109968 -0.205163 0.220155 0.246263 0.226091 0.217158 0.225344 0.242385 0.206858 0.228100 0.226407 0.200826 0.257251 0.253071 0.253756 0.400608
chargesum: 0.00000
title: Mulliken charges with hydrogens summed into heavy atoms:
elementType: Cl O O N C C C C C C C C C C C
charge: -0.080055 -0.238393 -0.025475 -0.257968 0.138135 0.109685 -0.012125 0.111171 0.105785 0.343576 0.095002 -0.144046 -0.083919 -0.109968 0.048593
polarizability: 1.92965533e+02 5.92985416e+00 1.30563218e+02 -1.48008554e+01 4.97145399e+00 9.46105772e+01
1716.lowfreq: -5.9824 -2.6411 -0.0021 -0.0017 0.0006 2.5918 40.0011 69.1596 69.9470
frequency: 39.9537 69.1559 69.8994 132.5735 170.4490 192.0335 206.4623 248.8887 295.6870 311.8344 328.9683 348.7121 359.8354 429.7499 432.7103 455.0501 467.1524 473.5283 540.6038 598.1841 622.4663 642.2172 718.0257 752.8469 774.9063 808.3678 820.4891 841.4839 864.2595 876.0420 898.7656 943.3397 982.4415 992.8885 1023.9696 1049.8876 1071.3566 1078.1908 1096.3333 1102.4431 1114.0121 1117.0510 1150.7457 1181.8825 1196.3966 1214.5936 1242.1126 1251.7927 1268.1748 1283.1351 1295.3538 1322.8970 1339.6629 1351.0813 1357.6552 1370.4282 1373.3906 1409.7793 1448.3491 1450.0076 1455.9496 1458.0822 1462.5021 1468.7531 1511.1071 1590.0080 1624.4262 2448.6739 2931.2866 2938.8425 2944.2421 2956.1601 2961.9710 3002.2194 3040.0786 3055.0840 3088.5156 3093.8913 3143.5027 3158.3037 3178.5483
redmass: 6.4508 4.9994 3.2976 8.5045 6.4209 4.2737 3.8092 1.9533 3.5128 2.9459 6.8546 2.3869 12.2269 3.2126 2.5371 3.8570 4.0834 3.0177 3.4342 2.3380 6.8409 4.8847 3.4618 4.7161 3.5744 3.5397 1.5205 1.6017 3.0000 1.7333 2.4291 1.3504 2.0112 2.6965 2.1997 1.8240 2.1036 3.1875 2.5932 1.9649 1.7049 2.0347 1.6238 2.1131 1.0926 1.2179 1.2945 2.8521 1.2938 1.2903 1.3645 1.3367 1.2223 2.5237 1.6989 1.5460 1.3029 3.5406 1.1067 1.0813 1.1447 1.1052 1.1896 2.1093 1.7450 4.1210 3.9739 1.0703 1.0661 1.0652 1.0645 1.0667 1.0665 1.0997 1.0955 1.0952 1.0959 1.0972 1.0924 1.0884 1.0974
irintensity: 0.3682 1.3060 0.5792 3.0950 6.0994 5.8080 5.2786 1.3635 0.6641 2.8946 0.4426 19.8679 1.2414 3.2385 12.7265 5.5989 25.8641 2.9535 5.8628 1.4193 15.5390 34.6696 1.0787 7.4723 23.5768 41.7612 44.5273 0.3308 39.3010 15.4244 15.9267 0.4930 17.8504 12.4988 13.5989 33.4321 16.4463 29.5977 33.9058 5.8936 45.5512 7.9180 28.3755 39.0665 6.5594 2.4872 15.0882 78.7623 18.7637 15.7828 12.7528 8.5524 7.8645 18.6880 2.1371 7.9464 2.7552 35.1355 7.4694 4.9479 46.8892 10.9106 4.6560 169.5388 73.4203 14.5095 67.6042 1471.9485 20.4612 31.3496 42.6174 36.3248 80.4080 14.6118 32.3804 19.4447 31.6512 23.2885 3.7459 2.3348 4.8417
temp: 298.150 k
press: 1.00000 atm
elementType: 17 8 8 7 6 6 6 6 6 6 6 6 6 6 6 1 1 1 1 1 1 1 1 1 1 1 1 1 1
symmnumber: 1
zpe: 612385.2 jmol-1
zpe.correction: 0.233245 hartree
zpe.thermalcorrener: 0.246562 hartree
zpe.thermalcorrenthalpy: 0.247506 hartree
zpe.thermalcorrgfe: 0.192724 hartree
zpe.sumelectzpe: -1091.676210 hartree
zpe.sumelectthermal: -1091.662893 hartree
zpe.sumelectthermalent: -1091.661949 hartree
zpe.sumelectthermalfe: -1091.716731 hartree
dipole: 2.8736 -1.6337 -1.0013
dipole: 3.4538
quadrupole: -109.9714 -96.7372 -93.0125
quadrupole: -4.8441 -6.8283 4.2099
quadrupole: -10.0644 3.1698 6.8945 -4.8441 -6.8283 4.2099
hfenergy: -1091.909455 hartree
pointgroup: C01 [X(C11H14Cl1N1O2)]
dipole: 1.1753659 0.5061108 0.4569476 debye
polarizability: 191.5491922|-12.3356802|130.5879125|14.269456|7.7202402|96.0022235 unknown
InChI: InChI=1S/C11H14ClNO2/c12-10-1-2-11(14)9(7-10)8-13-3-5-15-6-4-13/h1-2,7,14H,3-6,8H2
charge 0 multiplicity 1
29 atoms
Cl -4.818156 1.515844 -0.177802
O  4.15213 0.21508 -0.843056
O  0.112496 -1.928109 0.237994
N  1.539692 0.216915 0.425544
C  1.72637 0.712472 -0.975908
C  2.788346 0.413217 1.22199
C  0.332518 0.821579 1.087789
C  2.921829 -0.001893 -1.624139
C  3.966096 -0.28959 0.525477
C  -0.9595 0.256513 0.513606
C  -1.022352 -1.130961 0.163621
C  -2.119507 1.05444 0.395702
C  -2.247532 -1.697456 -0.265549
C  -3.323591 0.468771 -0.036688
C  -3.407283 -0.899449 -0.362554
H  1.903714 1.810994 -0.971539
H  0.802757 0.509902 -1.547425
H  2.637032 -0.015906 2.230173
H  3.013389 1.49802 1.331582
H  0.346845 1.930974 1.015808
H  0.405528 0.557602 2.162583
H  2.712753 -1.090227 -1.708138
H  3.129411 0.40918 -2.624851
H  4.912099 -0.081239 1.050761
H  3.790138 -1.387163 0.503387
H  -2.085798 2.119168 0.65059
H  -2.273946 -2.760924 -0.519755
H  -4.355134 -1.334374 -0.692461
H  0.921056 -1.253782 0.351059
