program: Gaussian 09
title: 000225449
version: EM64L-G09RevD.01
frameworkgroup: C1[X(C9H9N3O3)]
method: RPBEPBE
basis: SDD
operation: Freq
keyword: #pfreq=noraman
keyword: PBEPBE/SDD
title: #p freq=noraman PBEPBE/SDD
converged: NO YES NO NO
title: Mulliken charges:
elementType: O O O N N N C C C C C C C C C H H H H H H H H H
charge: -0.263401 -0.261067 -0.246987 0.048816 -0.393524 -0.649248 0.220743 0.171860 -0.487339 0.508198 -0.330968 -0.201770 -0.398437 -0.390953 0.304178 0.304182 0.251205 0.238731 0.238737 0.225637 0.202206 0.263164 0.346061 0.299974
chargesum: 0.00000
title: Mulliken charges with hydrogens summed into heavy atoms:
elementType: O O O N N N C C C C C C C C C
charge: -0.263401 -0.261067 -0.246987 0.048816 -0.130360 -0.003212 0.220743 0.171860 -0.183157 0.508198 -0.079763 0.275698 -0.172800 -0.188746 0.304178
polarizability: 2.70136718e+02 2.12855569e+00 1.36100961e+02 -1.78392920e-03 -3.66524555e-03 5.51396521e+01
1716.lowfreq: -33.8391 -5.9008 -4.8674 -0.0005 -0.0003 0.0008 5.1719 25.6550 51.3258
frequency: -33.7796 25.6454 51.3116 55.5226 121.3026 165.0267 185.6139 213.7487 247.7489 255.4717 340.4830 362.3127 368.7910 436.8141 437.1640 478.4085 486.4056 560.6944 577.0275 611.5184 613.7264 664.9458 680.9632 706.6132 722.5203 763.8778 787.2716 806.8221 841.6617 905.5395 910.5897 922.4490 940.2602 955.9683 981.8689 1040.1562 1061.1772 1064.9911 1109.0880 1119.5033 1143.4800 1194.6737 1255.6249 1261.5815 1288.9199 1342.5627 1366.2141 1396.5844 1455.0095 1473.7057 1487.2056 1514.8895 1581.4230 1604.8944 1608.8683 1624.7661 1684.4942 2958.6691 3012.5770 3089.6954 3134.2786 3181.6899 3185.6333 3360.8323 3537.6532 3695.4197
redmass: 2.3533 4.3517 5.9162 6.9706 5.6691 2.2411 6.6938 6.0399 4.3917 6.8961 1.6865 6.6669 4.4295 4.1190 3.1991 4.9747 1.1228 5.0472 1.2605 6.6836 4.1651 6.5388 9.5974 8.6172 4.3570 6.7842 5.5129 1.3567 10.6050 1.3496 3.6139 1.3984 1.5154 3.1144 3.9216 2.5368 4.0146 1.4572 3.0473 1.0366 1.7341 1.8315 1.8013 2.0062 2.2293 2.0503 1.2901 3.4763 4.6037 2.5262 1.2052 2.1039 6.8256 1.2123 7.5129 7.7240 5.4802 1.0865 1.0535 1.1189 1.0897 1.0951 1.0941 1.0748 1.0460 1.1035
irintensity: 15.4299 19.8199 0.3341 6.8952 0.2179 5.3495 3.7971 0.0281 0.8600 2.1332 83.1500 1.3125 20.7743 25.8275 0.7443 8.4293 227.6678 0.4785 113.7130 0.7445 30.0524 14.2087 1.0859 18.3575 5.2093 9.9425 18.4044 36.8703 20.4635 0.1394 1.1873 37.6459 33.1280 31.4409 133.7089 36.0493 5.1395 4.3306 213.5825 0.0089 40.2835 56.5731 108.5861 243.4023 554.4239 36.0401 0.0695 37.3624 101.6865 217.4143 15.5411 343.4035 2.5232 143.0443 4.3832 5.6565 278.1403 71.6590 136.9059 32.6592 11.7577 4.9515 5.5268 16.3711 65.6133 47.9249
temp: 298.150 k
press: 1.00000 atm
elementType: 8 8 8 7 7 7 6 6 6 6 6 6 6 6 6 1 1 1 1 1 1 1 1 1
symmnumber: 1
zpe: 460696.0 jmol-1
zpe.correction: 0.175470 hartree
zpe.thermalcorrener: 0.188332 hartree
zpe.thermalcorrenthalpy: 0.189277 hartree
zpe.thermalcorrgfe: 0.134510 hartree
zpe.sumelectzpe: -737.154338 hartree
zpe.sumelectthermal: -737.141475 hartree
zpe.sumelectthermalent: -737.140531 hartree
zpe.sumelectthermalfe: -737.195298 hartree
dipole: 1.3805 5.1853 -0.0010
dipole: 5.3659
quadrupole: -52.8607 -83.3751 -89.8260
quadrupole: 24.0506 -0.0103 -0.0006
quadrupole: 22.4932 -8.0212 -14.4720 24.0506 -0.0103 -0.0006
hfenergy: -737.3298076 hartree
pointgroup: C01 [X(C9H9N3O3)]
dipole: -0.4977677 -2.0515896 -0.0003924 debye
dipolederiv: -0.9637135 -0.413747 -0.0000323 -0.7059797 -0.8701531 -0.0000254 0.0000082 -0.0000045 -0.2538385 -1.5094942 -0.4467841 -0.0000038 -0.6444181 -0.6951529 -0.0000387 0.0000754 -0.0000048 -0.2476275 -0.6812201 -0.028699 -0.0001391 0.4233492 -1.1022146 -0.0003045 -0.0003305 0.0003367 -0.3694819 1.1680944 -0.3003431 -0.0000658 0.4921936 -0.3129201 -0.00003 -0.0001182 -0.0000291 -0.0774811 -2.1441117 0.624186 -0.0000955 0.4833586 -0.2578277 0.0001516 0.0000201 -0.0000054 -0.3608319 -1.6955766 -0.1654921 0.0001329 -0.259217 -0.3413384 -0.0000349 -0.0002977 -0.0000719 -0.7932801 0.0829052 0.293201 -0.0000039 1.0801588 0.8308086 0.000013 0.000026 0.0000158 0.0510671 1.3415903 0.5818314 -0.0000122 0.1908554 0.0222941 -0.0000245 -0.0001082 -0.0000514 0.0320088 -0.0801409 -0.1449744 -0.0000052 -0.0006911 -0.0669863 0.0000085 0.000001 0.0000115 -0.1510414 -0.035516 0.0104899 0.0000103 -0.1258104 -0.0517974 0.0000018 -0.0000117 0.0000126 0.0120548 -0.1219299 -0.0356436 0.000001 -0.3364696 0.021932 0.0000279 -0.0000197 0.0000114 -0.1552187 0.9855132 0.3018453 0.0000709 0.5300242 0.7903505 0.0000516 0.0001024 0.0000625 0.576069 0.0279794 -0.0426931 -0.0000241 0.0171307 0.004447 0.0000087 -0.0000386 0.0000118 -0.2095313 0.3605618 0.1188055 -0.0000352 0.4525612 0.3395508 0.0000013 0.0001754 -0.0000125 -0.1305013 2.8169429 -0.1489006 0.0004695 -1.167458 1.665708 0.000313 0.0010354 -0.0000585 0.3523516 0.1158272 0.0570792 0.0000064 0.030757 0.0609831 -0.0000065 0.0000009 -0.0000102 0.1782663 0.0073786 0.0811201 0.000012 0.0853307 0.0204087 -0.0000133 0.0000148 -0.0000119 0.1796727 -0.0462076 -0.0772377 -0.0527254 -0.1126002 -0.0008924 -0.0416782 -0.1459926 -0.1030348 -0.0708152 -0.046212 -0.0772623 0.0527129 -0.1126351 -0.0009097 0.0416952 0.1459072 0.1030123 -0.0707199 0.0608369 -0.0994928 0. -0.0662632 -0.0763716 -0.0000114 -0.0000022 -0.0000089 0.167403 -0.0545412 -0.0752267 0.0000085 -0.1181817 -0.177322 -0.0000181 0.0000008 -0.0000138 0.1846679 -0.0812997 -0.0002218 0.0000198 -0.0957387 -0.0513948 -0.0000256 0.0000405 -0.0000696 0.3398005 0.2541906 -0.0080569 -0.0001318 -0.0470086 0.1728825 -0.0000207 -0.0001993 -0.0000176 0.4062224 0.2381429 -0.0037834 -0.00017 0.006752 0.0759158 -0.0000409 -0.0002894 -0.0000699 0.4107846 unknown
polarizability: 269.9765211|5.0967865|136.261158|0.0017022|0.0037039|55.1396521 unknown
InChI: InChI=1S/C9H9N3O3/c10-9(13)12-11-4-6-1-2-7-8(3-6)15-5-14-7/h1-4,12H,5,10H2
charge 0 multiplicity 1
24 atoms
O  2.781189 1.90571 -0.000202
O  4.331372 0.06901 -0.000374
O  -4.176209 1.692599 -0.000296
N  -2.088716 -0.201076 -0.00005
N  -3.419553 -0.551964 0.000045
N  -5.709364 -0.06759 -0.000677
C  2.083107 0.671895 -0.00021
C  2.999791 -0.407517 -0.000313
C  0.707258 0.481068 -0.000165
C  0.240722 -0.875229 -0.000223
C  2.570856 -1.735947 -0.000377
C  4.224345 1.555425 -0.000155
C  1.167634 -1.954138 -0.000326
C  -1.195456 -1.169691 -0.000183
C  -4.415734 0.460443 0.000143
H  -0.009204 1.305852 -0.000087
H  3.282328 -2.565196 -0.000461
H  4.692219 1.947062 0.919626
H  4.692343 1.947341 -0.919749
H  0.792389 -2.984247 -0.000368
H  -1.481959 -2.242749 -0.000227
H  -3.69951 -1.545211 -0.000053
H  -6.47329 0.603344 -0.001242
H  -5.926459 -1.062192 -0.000977
