program: Gaussian 09
title: 000225447
version: EM64L-G09RevD.01
frameworkgroup: C1[X(C7H13NO2)]
method: RPBEPBE
basis: SDD
operation: Freq
keyword: #p
keyword: freq=noraman
keyword: PBEPBE/SDD
title: #p freq=noraman PBEPBE/SDD
converged: YES YES NO NO
title: Mulliken charges:
elementType: O O N C C C C C C C H H H H H H H H H H H H H
charge: -0.245042 -0.291102 -0.145621 -0.363953 -0.374214 -0.301174 -0.289200 0.264657 -0.490550 -0.671448 0.265620 0.224933 0.229463 0.231825 0.223560 0.200182 0.191169 0.221186 0.227483 0.224071 0.202981 0.230545 0.234630
chargesum: 0.00000
title: Mulliken charges with hydrogens summed into heavy atoms:
elementType: O O N C C C C C C C
charge: -0.245042 -0.291102 -0.145621 0.126600 0.087073 0.122568 0.123154 0.264657 -0.038996 -0.003293
polarizability: 1.07078686e+02 1.83533527e+00 8.84431408e+01 -3.12693687e+00 -1.32078371e+00 6.64410793e+01
1716.lowfreq: -11.7505 -0.0007 0.0002 0.0003 9.3761 19.6577 50.3660 70.8409 111.8449
frequency: 50.2531 70.8129 111.8380 159.6188 198.7112 240.7104 270.7324 318.1705 341.0819 393.4565 445.3045 478.4296 536.7265 556.5339 611.9731 719.3492 793.8803 810.6279 832.6574 887.9440 921.2360 1002.7824 1012.1844 1027.8974 1051.0324 1071.3780 1075.0596 1083.1317 1110.8377 1183.4534 1192.0158 1212.3655 1254.5410 1260.0803 1274.1842 1311.8981 1327.7581 1342.1120 1353.5893 1367.3910 1396.5968 1411.3646 1446.6291 1448.6048 1453.9174 1455.3396 1460.8674 1466.1936 1479.0418 1587.2786 2945.6703 2959.2188 2968.6979 2969.9375 2980.3994 2999.0592 3018.9498 3080.4928 3081.3325 3090.6034 3094.3152 3095.2536 3108.6206
redmass: 3.1405 4.4800 1.7320 3.0706 1.2894 2.1571 2.9223 3.2616 5.0735 1.8816 2.8849 4.0780 2.8784 3.2098 2.1926 3.2273 4.2311 1.3439 1.6658 3.0001 2.6336 1.9801 2.3618 1.9326 2.1203 3.5789 1.6256 2.4488 2.2064 2.4918 1.0941 1.6207 1.3017 1.4882 1.1983 1.5407 1.2751 1.2298 1.3382 1.3084 1.2283 2.6705 1.0834 1.1015 1.0891 1.0975 1.1090 1.0406 1.0553 7.5738 1.0684 1.0681 1.0603 1.0669 1.0651 1.0368 1.0998 1.0960 1.0959 1.0984 1.0958 1.0966 1.1002
irintensity: 0.2481 3.3409 1.8886 1.2070 0.2376 4.3620 17.2495 9.6334 6.0039 0.9298 1.0254 1.2277 10.7809 10.3251 6.3515 1.1069 16.9900 13.6032 0.8402 1.9610 8.6724 26.3072 6.6988 22.6383 35.5826 36.2212 2.2922 6.5368 5.7537 7.7175 0.7161 165.5697 12.4344 32.3025 6.1609 8.6766 3.4623 6.4461 2.4288 0.6209 14.0549 117.4955 6.2197 26.7297 12.1235 10.0411 12.1928 8.8630 16.5184 240.9623 50.4224 46.8239 18.7220 52.3851 71.5319 31.6363 15.7791 39.9010 9.4396 35.3690 1.6769 44.9289 30.1840
temp: 298.150 k
press: 1.00000 atm
elementType: 8 8 7 6 6 6 6 6 6 6 1 1 1 1 1 1 1 1 1 1 1 1 1
symmnumber: 1
zpe: 515962.1 jmol-1
zpe.correction: 0.196520 hartree
zpe.thermalcorrener: 0.206843 hartree
zpe.thermalcorrenthalpy: 0.207787 hartree
zpe.thermalcorrgfe: 0.160432 hartree
zpe.sumelectzpe: -478.927750 hartree
zpe.sumelectthermal: -478.917426 hartree
zpe.sumelectthermalent: -478.916482 hartree
zpe.sumelectthermalfe: -478.963837 hartree
dipole: -0.5268 -2.9991 0.2652
dipole: 3.0566
quadrupole: -70.4355 -59.7752 -59.3845
quadrupole: -8.1726 0.6167 0.3383
quadrupole: -7.2371 3.4232 3.8139 -8.1726 0.6167 0.3383
hfenergy: -479.1242692 hartree
pointgroup: C01 [X(C7H13N1O2)]
dipole: 0.2334152 1.1722984 0.1317037 debye
dipolederiv: -0.5460561 0.0291322 0.0841188 0.0290361 -0.7795914 -0.0076436 0.0880322 -0.012292 -0.4427081 -0.8824204 -0.1003636 -0.0772022 -0.4994232 -0.9077669 -0.1113278 -0.154334 -0.0692108 -0.3585751 -1.3505549 -0.2003728 -0.115546 -0.0200735 -0.495813 -0.0157823 -0.0228063 -0.0163278 -0.3753267 0.1184738 -0.2063048 0.0558783 -0.3372541 0.1433976 -0.0748 0.0556263 -0.0673498 0.2421303 0.0978477 0.1940163 0.0835139 0.2400718 0.3071194 0.0774159 0.1174169 0.0801123 0.2770359 0.3250579 0.1774047 0.0128457 0.1188724 0.5580972 0.0646815 -0.0758612 0.0748289 0.3625787 0.407438 -0.2199447 0.0017335 -0.1488757 0.4709168 -0.039022 -0.0653339 -0.0657825 0.3512492 1.7476712 0.2383708 0.2655127 0.3528412 0.8917402 0.1130326 0.3445045 0.1082314 0.1660132 -0.0708086 0.0893334 -0.0303627 0.2039228 -0.1574377 0.0113976 -0.048823 -0.0037984 0.168311 -0.0011522 -0.0430284 -0.012493 -0.0309287 0.0817797 -0.009397 -0.0107032 -0.012995 0.0578305 0.1442242 -0.1132637 -0.0052971 0.0047397 0.0026934 -0.0188773 0.0108623 -0.0348243 0.0971876 -0.0280315 0.064191 -0.0522182 0.0760942 0.0760554 -0.0228496 -0.0707644 0.0550919 -0.155413 0.0007151 -0.0788317 -0.0607762 -0.0741534 0.0271701 0.0223839 -0.0765656 -0.0692223 -0.160434 0.0151984 0.1285977 -0.0042702 0.0849914 -0.0430029 0.0151414 -0.0171384 0.0286335 0.0800824 -0.0725795 0.1160502 -0.005737 0.0854263 -0.0688256 0.0039106 -0.0287107 0.0345822 0.0924253 0.0402371 -0.0780622 -0.0837128 -0.0298571 0.0013048 0.0407662 -0.0194897 -0.054245 -0.1896111 0.0011184 0.093678 -0.0738328 0.0352964 0.0241973 -0.0271236 -0.0386293 0.0769501 -0.1916165 -0.0240864 -0.1012811 -0.0139803 -0.0749192 -0.1183424 -0.0277163 -0.025332 -0.0641263 0.0811041 0.0266059 -0.0093204 -0.065856 -0.0038008 0.0076517 -0.0817791 -0.0586329 -0.1094385 -0.0771968 -0.0262886 -0.0545109 0.0747693 -0.0373035 -0.0154284 0.0781931 0.0755435 0.1030811 -0.0114214 -0.052357 0.1076338 -0.0174673 0.173062 -0.0930116 0.019293 -0.0160081 0.0104893 0.0991952 0.0488951 -0.0318935 0.0353073 -0.0911669 0.0333228 0.0967491 0.0660078 0.0924963 -0.03982 0.0808526 -0.0012303 0.005072 -0.0565982 0.0537737 -0.1066465 -0.0288608 -0.0848841 -0.0730208 unknown
polarizability: 107.0781461|1.3103137|88.3049936|3.6396795|1.7230119|66.5797663 unknown
InChI: InChI=1S/C7H13NO2/c1-2-7(9)8-3-5-10-6-4-8/h2-6H2,1H3
charge 0 multiplicity 1
23 atoms
O  2.910431 0.244814 -0.130667
O  -1.699135 -1.513095 -0.185616
N  0.08547 -0.110445 0.301518
C  1.011517 -1.258563 0.43018
C  0.718265 1.197556 0.564062
C  2.248714 -1.035478 -0.456663
C  1.973077 1.35984 -0.324449
C  -1.261785 -0.335881 0.013038
C  -2.184321 0.894415 -0.054286
C  -3.648958 0.497511 -0.313891
H  0.460292 -2.167764 0.136866
H  1.328122 -1.356635 1.488459
H  1.023486 1.252332 1.62978
H  0.012743 2.019052 0.364491
H  3.011601 -1.810717 -0.27942
H  1.95318 -1.040599 -1.527903
H  1.668988 1.417098 -1.393011
H  2.534454 2.268657 -0.050862
H  -2.107384 1.464265 0.893531
H  -1.830881 1.574609 -0.855776
H  -4.285765 1.398224 -0.381045
H  -4.030442 -0.147847 0.494994
H  -3.738667 -0.074252 -1.25233
