program: Gaussian 09
title: 000225421
version: EM64L-G09RevD.01
frameworkgroup: C1[X(C18H21N3O2)]
method: RPBEPBE
basis: SDD
operation: Freq
keyword: #p
keyword: freq=noraman
keyword: PBEPBE/SDD
title: #p freq=noraman PBEPBE/SDD
converged: YES YES NO NO
title: Mulliken charges:
elementType: O O N N N C C C C C C C C C C C C C C C C C C H H H H H H H H H H H H H H H H H H H H H
charge: -0.239817 -0.245552 -0.148611 -0.127347 -0.413506 0.458394 -0.398195 -0.400899 -0.364549 -0.341891 -0.657553 -0.656329 0.219480 -0.362059 -0.410277 0.018086 0.340129 -0.233348 -0.465886 -0.344687 0.173769 0.199757 -0.793514 0.227627 0.227693 0.229785 0.228117 0.233323 0.234656 0.220434 0.241798 0.221952 0.220468 0.239045 0.221830 0.264980 0.249756 0.261666 0.329112 0.253462 0.350840 0.263866 0.237189 0.236809
chargesum: 0.00000
title: Mulliken charges with hydrogens summed into heavy atoms:
elementType: O O N N N C C C C C C C C C C C C C C C C C C
charge: -0.239817 -0.245552 -0.148611 -0.127347 -0.062667 0.458394 0.057125 0.057003 -0.131227 -0.107236 0.026631 0.025014 0.219480 -0.097080 -0.160521 0.018086 0.340129 0.028318 -0.136774 -0.091225 0.173769 0.199757 -0.055649
polarizability: 5.88012156e+02 -6.69405734e+01 2.64293791e+02 -3.09397704e+00 -8.59119356e+00 1.22130667e+02
1716.lowfreq: -51.5714 -3.9314 -2.4745 -0.0005 0.0007 0.0008 1.4319 22.6668 28.5119
frequency: -51.5675 22.6000 28.4907 38.0754 62.6159 73.3487 79.4141 87.0324 93.8915 110.3340 119.3797 139.5570 176.5738 194.3196 204.4626 211.6884 222.3416 242.0709 299.7938 303.9893 308.4898 335.3993 352.6834 369.0056 414.5084 423.6243 425.4433 468.3436 491.6259 500.5111 516.8704 524.7066 553.3779 574.0308 583.6025 626.5621 636.1586 645.2133 690.6113 722.5939 737.8824 755.2317 769.1529 786.5616 789.3746 797.4693 820.5790 827.1857 849.3870 863.8905 892.1104 911.8390 922.4551 924.9793 927.5114 944.5023 954.9598 985.1084 986.4084 989.9319 1014.2837 1032.9087 1073.2238 1075.8637 1093.7632 1102.8509 1131.5716 1161.3761 1175.5478 1195.7443 1199.1909 1215.7993 1229.2800 1253.4432 1268.6566 1286.6914 1297.5319 1311.1249 1339.9379 1344.1454 1348.8009 1358.8585 1374.7854 1387.7060 1388.8573 1391.0400 1404.1153 1448.3454 1456.4168 1466.2190 1466.4997 1467.5227 1476.9029 1479.9637 1482.4264 1494.5107 1497.1707 1505.0851 1518.1197 1527.1357 1535.6629 1569.9112 1616.8194 1623.0016 1637.9911 2986.2796 2987.3020 2988.6752 2997.9236 3002.8854 3046.1080 3051.8877 3074.0735 3083.7632 3084.3480 3093.8670 3095.4360 3135.3785 3137.0873 3145.2828 3146.2723 3162.8974 3167.8124 3173.0686 3199.8039 3342.9136
redmass: 1.0470 3.8988 4.9640 5.3680 3.2517 5.0098 4.0478 3.5015 3.5703 4.0974 4.1217 4.0219 4.7574 1.6722 2.2051 1.4068 3.4133 2.5293 3.7864 3.4410 3.8932 4.4736 4.9313 4.4966 3.2897 3.7469 3.3221 5.0020 3.3842 3.6309 3.7647 3.1767 2.6685 2.9498 4.5081 6.5619 5.5734 3.5131 4.5315 4.3727 5.4498 4.6563 4.0532 1.1334 1.2565 1.3451 1.7944 1.6840 1.1270 6.3018 2.2964 2.6735 1.4782 2.1614 4.7508 1.3382 1.3427 1.2739 2.8459 1.7191 2.9394 1.6800 2.1818 1.8237 1.6852 1.7640 1.5566 1.9052 1.7183 1.9435 2.0408 1.4792 1.7537 2.6287 1.3756 1.2030 2.7362 1.7311 1.3669 1.9902 1.3409 3.1600 1.2532 2.9659 1.2169 1.2648 2.0295 1.1440 3.5763 1.0471 1.0621 1.0450 1.6259 1.9996 1.0518 1.1150 2.2373 1.6912 1.7603 5.7214 6.8563 6.4662 5.6170 6.6501 7.5346 1.0356 1.0357 1.0379 1.0603 1.0610 1.1029 1.1022 1.0981 1.0998 1.0998 1.1013 1.1010 1.0985 1.0863 1.0874 1.0877 1.0979 1.0951 1.0959 1.0930 1.0762
irintensity: 0.4568 0.8358 0.1738 2.2142 0.8564 4.3318 2.2217 2.4532 0.0908 0.4276 1.3158 5.3397 4.2766 0.8217 1.6343 0.2807 1.0479 1.9106 0.4731 2.7256 1.8871 0.9575 12.9093 12.6084 2.6512 2.8772 27.0560 11.5680 4.6095 51.6521 21.6531 12.3205 7.6450 0.4439 1.5606 4.3169 13.4727 1.9609 5.6678 12.2654 1.4059 5.9568 4.4407 4.3992 33.3013 12.7547 75.2780 13.5793 71.1246 28.5393 0.1359 5.6011 52.8278 5.3959 23.3450 1.3212 1.7577 0.9202 0.3054 26.3094 58.3332 9.1362 13.4451 66.9088 18.3429 24.2672 2.4934 45.2628 107.0274 46.2881 47.6683 5.8882 84.6788 53.6191 113.0319 3.4345 61.1630 6.8198 30.5815 54.2619 213.3574 22.4823 45.2634 56.7872 0.9432 22.8752 178.2231 195.6500 28.6673 19.7773 7.7374 14.3328 371.0992 504.3003 0.5356 52.4631 685.0818 11.9308 26.1700 36.0807 45.0254 101.8878 231.3988 560.9701 25.4833 34.7754 29.2553 5.4780 49.9610 81.7787 5.1318 9.0163 14.8577 38.2190 50.4134 10.9033 87.5826 11.3714 0.8231 1.8043 8.8362 6.4892 24.0525 21.6917 8.3310 122.1473
temp: 298.150 k
press: 1.00000 atm
elementType: 8 8 7 7 7 6 6 6 6 6 6 6 6 6 6 6 6 6 6 6 6 6 6 1 1 1 1 1 1 1 1 1 1 1 1 1 1 1 1 1 1 1 1 1
symmnumber: 1
zpe: 933923.0 jmol-1
zpe.correction: 0.355712 hartree
zpe.thermalcorrener: 0.377677 hartree
zpe.thermalcorrenthalpy: 0.378621 hartree
zpe.thermalcorrgfe: 0.303034 hartree
zpe.sumelectzpe: -1011.534543 hartree
zpe.sumelectthermal: -1011.512579 hartree
zpe.sumelectthermalent: -1011.511634 hartree
zpe.sumelectthermalfe: -1011.587221 hartree
dipole: -15.1051 3.3397 -0.1969
dipole: 15.4712
quadrupole: -158.1935 -132.0240 -136.9410
quadrupole: 19.5312 -2.2022 -4.1834
quadrupole: -15.8073 10.3622 5.4451 19.5312 -2.2022 -4.1834
hfenergy: -1011.8902558 hartree
pointgroup: C01 [X(C18H21N3O2)]
dipole: -5.8774291 1.4458445 -0.6440252 debye
polarizability: 581.2557226|-77.3741937|244.4589448|25.6497874|-57.5685842|148.7219473 unknown
InChI: InChI=1S/C18H21N3O2/c1-4-21(5-2)15-8-6-14(7-9-15)20-17-11-10-16(23)12-18(17)19-13(3)22/h6-12,19H,4-5H2,1-3H3
charge 0 multiplicity 1
44 atoms
O  4.960345 -3.20227 1.284199
O  5.711778 1.461958 -0.200007
N  -4.74235 0.235425 0.048015
N  0.934812 0.268724 -0.229334
N  3.393658 1.135094 -0.335361
C  -3.349721 0.226816 0.001223
C  -5.490283 -0.443957 1.129323
C  -5.550019 0.923138 -0.983719
C  -2.56916 -0.500035 0.964527
C  -2.626148 0.968299 -0.995639
C  -5.725496 -1.948944 0.863116
C  -5.778393 2.424069 -0.689263
C  -0.453317 0.182437 -0.113286
C  -1.171411 -0.529274 0.902768
C  -1.229176 0.95952 -1.029057
C  1.837162 -0.644732 0.146145
C  3.258113 -0.192515 0.10058
C  1.585984 -2.038651 0.516995
C  4.291725 -1.028122 0.489376
C  2.614892 -2.875812 0.869235
C  4.023949 -2.405178 0.913246
C  4.556577 1.895235 -0.477988
C  4.30295 3.308155 -1.002536
H  -4.963931 -0.301248 2.090912
H  -6.464009 0.069031 1.234317
H  -5.073716 0.792492 -1.972414
H  -6.52602 0.40685 -1.042584
H  -3.061396 -1.045484 1.774237
H  -3.160301 1.57549 -1.730909
H  -6.296234 -2.098754 -0.070912
H  -4.769372 -2.491638 0.766328
H  -6.299482 -2.401374 1.692558
H  -6.298647 2.561275 0.275752
H  -4.821523 2.971769 -0.638568
H  -6.399224 2.881331 -1.481527
H  -0.62177 -1.056089 1.689399
H  -0.692809 1.54472 -1.783313
H  0.562788 -2.419613 0.44114
H  5.325344 -0.67777 0.48562
H  2.448184 -3.932564 1.107125
H  2.472774 1.545357 -0.568833
H  5.264927 3.835496 -1.074528
H  3.634445 3.870763 -0.324866
H  3.831799 3.283284 -2.002588
