program: Gaussian 09
title: 000225412
version: EM64L-G09RevD.01
frameworkgroup: C1[X(C16H17N3O2)]
method: RPBEPBE
basis: SDD
operation: Freq
keyword: #p
keyword: freq=noraman
keyword: PBEPBE/SDD
title: #p freq=noraman PBEPBE/SDD
converged: YES YES NO NO
title: Mulliken charges:
elementType: O O N N N C C C C C C C C C C C C C C C C H H H H H H H H H H H H H H H H H
charge: -0.238259 -0.245006 -0.147627 -0.128001 -0.413612 0.411864 0.224484 0.016363 -0.349655 -0.325253 0.341686 -0.352888 -0.400112 -0.233938 -0.644503 -0.644102 -0.465131 -0.343012 0.174160 0.200254 -0.793115 0.243585 0.244055 0.266392 0.249974 0.264017 0.239931 0.243635 0.223849 0.241605 0.241527 0.223317 0.329468 0.351235 0.254151 0.264111 0.237041 0.237513
chargesum: 0.00000
title: Mulliken charges with hydrogens summed into heavy atoms:
elementType: O O N N N C C C C C C C C C C C C C C C C
charge: -0.238259 -0.245006 -0.147627 -0.128001 -0.062377 0.411864 0.224484 0.016363 -0.106070 -0.081198 0.341686 -0.086496 -0.150138 0.030078 0.062912 0.062346 -0.135663 -0.088862 0.174160 0.200254 -0.054450
polarizability: 5.35024522e+02 -6.51998452e+01 2.38199953e+02 -5.11304503e+00 -8.75613494e+00 1.05655359e+02
1716.lowfreq: -55.1616 -2.9399 -0.0006 -0.0006 -0.0005 1.6076 3.8828 32.4717 34.2516
frequency: -55.1608 32.4479 34.2204 44.9592 72.4548 78.1435 88.2799 105.6060 118.5173 129.7625 144.2608 190.3652 199.4324 203.5782 224.7590 251.7336 286.5173 312.2423 324.7991 356.2139 387.3493 402.4163 427.8075 461.7464 473.9899 493.2290 506.0103 520.5093 540.9665 573.9536 590.4833 626.8257 637.5746 645.3314 704.7660 728.6838 738.4647 758.3865 773.1442 800.3644 823.6055 829.5345 848.3828 862.9038 911.7724 922.6664 927.0753 939.7751 946.6135 957.5120 986.3372 987.1748 989.7798 1033.0494 1056.1328 1102.5175 1103.2662 1111.4770 1130.9552 1165.6108 1175.0528 1195.9278 1215.3003 1229.2813 1250.8195 1254.1365 1298.1960 1311.3725 1342.6367 1362.9609 1371.0756 1374.8386 1387.9247 1431.6248 1448.0705 1454.3597 1456.4022 1465.4200 1466.0596 1477.9498 1482.0007 1490.9082 1496.6075 1500.0350 1520.4692 1530.3021 1536.8920 1571.1128 1617.5890 1623.8178 1638.6420 2951.4297 2957.8869 2989.1728 3022.3220 3024.9169 3074.6417 3104.2482 3114.2705 3136.1563 3137.9230 3146.4062 3148.3312 3164.0390 3171.0110 3175.6358 3199.7294 3343.2473
redmass: 1.0418 3.8292 5.1503 4.5428 2.5001 4.7126 4.5822 4.2189 1.5057 3.9781 3.2508 1.3103 3.9072 5.2783 4.4658 3.4546 3.9827 4.3294 5.5637 5.2628 4.5565 4.3747 3.1638 4.7345 4.0458 3.4694 4.5366 4.2647 2.4414 2.9486 5.0333 6.6090 5.5805 3.5401 4.7915 4.7770 5.3485 4.8407 5.0191 1.3298 1.7475 1.7170 1.1348 6.4355 2.6768 1.4724 4.8806 2.8939 1.3776 1.3441 1.3216 2.6228 1.7218 1.6807 1.5156 1.3731 1.5426 1.3310 1.4654 1.6834 1.6748 1.7439 1.5273 1.7381 2.7114 2.8572 2.6911 1.7630 2.2135 3.4243 3.3049 1.2612 3.2674 1.1947 1.1499 1.8388 1.7686 1.0443 1.0471 1.0488 4.6431 1.1661 1.9194 1.4712 2.0601 6.2720 6.6102 6.4701 5.4789 6.8141 7.4092 1.0369 1.0393 1.0379 1.0993 1.1026 1.0981 1.0969 1.0949 1.0985 1.0864 1.0879 1.0881 1.0982 1.0946 1.0958 1.0931 1.0762
irintensity: 0.4617 1.4510 0.1568 2.1827 0.4979 5.4633 3.0780 1.6713 1.9830 6.7080 2.3919 0.8785 0.5956 1.2955 1.0311 6.5160 5.8911 2.6080 2.4396 12.1798 2.5531 7.8842 8.9635 18.1571 3.7350 7.7551 42.8516 17.7647 22.6312 0.4743 0.9738 4.5364 12.1979 2.0966 5.3535 15.9319 1.5449 4.2466 5.8121 22.9513 62.8014 26.4182 76.2854 24.6029 4.7778 56.0268 23.6715 34.9069 8.0437 1.9130 1.5859 0.0610 25.2087 9.1912 24.3828 9.5154 13.9204 2.3578 8.5314 1.6083 117.7456 46.9426 7.3233 79.0317 43.9825 33.1376 65.7811 6.3767 55.3607 27.5846 309.5333 54.9942 65.9752 8.8103 214.8856 108.9926 34.2477 0.1282 19.3243 29.4607 629.8936 7.2299 635.6794 129.6642 104.7743 46.5425 40.3647 96.7298 128.5014 600.0713 29.5405 80.6293 202.6883 5.4217 2.0468 69.0079 14.7531 3.5216 44.6750 10.9624 0.8568 2.2353 4.8983 8.0700 18.7798 18.0632 8.2485 117.8152
temp: 298.150 k
press: 1.00000 atm
elementType: 8 8 7 7 7 6 6 6 6 6 6 6 6 6 6 6 6 6 6 6 6 1 1 1 1 1 1 1 1 1 1 1 1 1 1 1 1 1
symmnumber: 1
zpe: 786338.9 jmol-1
zpe.correction: 0.299501 hartree
zpe.thermalcorrener: 0.318971 hartree
zpe.thermalcorrenthalpy: 0.319915 hartree
zpe.thermalcorrgfe: 0.250282 hartree
zpe.sumelectzpe: -933.084116 hartree
zpe.sumelectthermal: -933.064645 hartree
zpe.sumelectthermalent: -933.063701 hartree
zpe.sumelectthermalfe: -933.133334 hartree
dipole: -14.5543 3.3848 -0.1002
dipole: 14.9431
quadrupole: -128.2646 -119.7610 -124.2528
quadrupole: 17.5358 -2.0893 -4.0990
quadrupole: -4.1718 4.3318 -0.1600 17.5358 -2.0893 -4.0990
hfenergy: -933.3836164 hartree
pointgroup: C01 [X(C16H17N3O2)]
dipole: 5.6252897 1.4687162 0.8731677 debye
polarizability: 525.1102486|76.112509|206.8490755|36.5029542|65.1807811|146.9205102 unknown
InChI: InChI=1S/C16H17N3O2/c1-11(20)17-16-10-14(21)8-9-15(16)18-12-4-6-13(7-5-12)19(2)3/h4-10,17H,1-3H3
charge 0 multiplicity 1
38 atoms
O  -4.274402 -3.102658 -1.686344
O  -5.168083 1.348234 0.292491
N  5.309675 0.368909 0.047811
N  -0.361266 0.273694 0.267035
N  -2.844543 1.063792 0.431091
C  3.918123 0.332672 0.079318
C  1.031086 0.227844 0.158559
C  -1.235814 -0.613456 -0.219162
C  3.164018 -0.276143 -0.980128
C  3.180577 0.928503 1.158128
C  -2.669019 -0.202872 -0.147319
C  1.766244 -0.338533 -0.933693
C  1.782956 0.895537 1.174726
C  -0.942932 -1.951311 -0.737871
C  6.042668 -0.252404 -1.066145
C  6.057021 1.047771 1.117856
C  -3.674715 -1.015372 -0.643308
C  -1.944667 -2.768845 -1.197024
C  -3.36481 -2.330236 -1.211667
C  -4.02891 1.774894 0.638497
C  -3.819294 3.125271 1.32257
H  3.676449 -0.683968 -1.85552
H  3.705851 1.426419 1.977046
H  1.22799 -0.765754 -1.785997
H  1.229328 1.365341 1.994289
H  0.089237 -2.311703 -0.688415
H  5.822281 0.243481 -2.032971
H  5.794128 -1.327067 -1.165149
H  7.124871 -0.171121 -0.882392
H  5.864264 0.586158 2.10666
H  5.795415 2.122606 1.182219
H  7.136092 0.973255 0.914101
H  -4.717392 -0.693855 -0.618414
H  -1.938168 1.467228 0.725351
H  -1.747595 -3.788229 -1.547709
H  -4.793313 3.625169 1.422041
H  -3.141728 3.77058 0.733518
H  -3.378323 2.996171 2.328325
