program: Gaussian 09
title: 000225405
version: EM64L-G09RevD.01
frameworkgroup: C1[X(C11H13N3O)]
method: RPBEPBE
basis: SDD
operation: Freq
keyword: #p
keyword: freq=noraman
keyword: PBEPBE/SDD
title: #p freq=noraman PBEPBE/SDD
converged: YES YES NO NO
title: Mulliken charges:
elementType: O N N N C C C C C C C C C C C H H H H H H H H H H H H H
charge: -0.268725 -0.212278 -0.098414 -0.674566 0.229354 -0.341767 -0.069669 0.158853 0.141708 0.317747 -0.395615 -0.666757 -0.780681 -0.403712 -0.206579 0.223334 0.262291 0.267021 0.262385 0.209817 0.221311 0.236103 0.237122 0.265293 0.221471 0.223027 0.301432 0.340495
chargesum: 0.00000
title: Mulliken charges with hydrogens summed into heavy atoms:
elementType: O N N N C C C C C C C C C C C
charge: -0.268725 -0.212278 -0.098414 -0.032639 0.229354 0.143858 -0.069669 0.158853 0.141708 0.317747 -0.128594 0.026756 -0.042164 -0.182241 0.016448
polarizability: 2.13137671e+02 -3.77695534e+00 1.66729719e+02 6.27281608e+00 1.35588326e+00 7.33089873e+01
1716.lowfreq: -9.9374 -2.3862 -0.0002 0.0007 0.0008 9.5402 56.0472 76.3999 94.0005
frequency: 55.8918 76.3524 93.9819 153.3459 181.4816 201.7604 204.7793 219.5688 222.3974 324.7450 335.1199 338.8599 380.6521 384.6865 398.3588 431.2900 471.7698 522.5142 541.7321 550.4689 578.0876 602.0533 607.2537 638.9498 663.1805 724.6887 762.2691 766.4853 822.4954 832.5478 846.8969 888.5929 948.0757 973.4940 975.8794 1001.7267 1034.4080 1043.4957 1046.2129 1086.6802 1099.8803 1147.6828 1174.8185 1202.8749 1242.3925 1271.4007 1293.0603 1334.5725 1342.0850 1378.1514 1386.8425 1397.6906 1414.6563 1447.3319 1448.4432 1465.2118 1471.1734 1472.1631 1485.6012 1486.5884 1554.7548 1580.5594 1598.1568 1604.2887 1625.5726 2986.2671 2989.0775 3040.9940 3065.7055 3081.1324 3094.7926 3114.2015 3123.6635 3129.1592 3146.5950 3175.3022 3527.9817 3694.8640
redmass: 3.5628 3.3028 4.0260 4.4193 2.8379 1.4703 1.5678 2.3180 1.7943 3.1660 3.2977 4.1939 1.3098 2.8231 3.7782 5.3064 4.0735 3.7452 7.5789 3.4462 5.0407 1.3011 3.4194 3.7275 5.4475 6.8313 1.6561 1.3765 3.4028 3.0862 4.5753 1.4330 2.6250 1.3223 2.9317 1.9757 1.8215 1.8854 1.9591 2.0452 1.6965 2.1426 1.3305 3.0045 2.8152 3.0575 1.7432 2.0278 1.6976 1.7875 1.2190 1.2969 7.9279 2.4981 1.2011 1.0808 1.1503 1.0489 3.5699 1.0616 5.0872 1.7291 4.5320 7.2246 3.8009 1.0398 1.0361 1.0609 1.0967 1.0986 1.1007 1.1035 1.0873 1.0973 1.0930 1.0964 1.0460 1.1025
irintensity: 1.8001 2.3693 2.1512 1.4730 1.8300 1.3278 0.5067 3.7442 0.8165 23.2482 3.8860 4.8038 149.5229 8.2096 18.4745 0.2957 4.8897 2.2213 0.6933 14.7728 1.7859 79.5628 7.1857 5.4845 11.6561 5.9413 70.4355 7.0384 18.9559 8.3398 2.9155 0.0395 1.4886 2.0478 0.8361 0.1275 14.5678 10.1082 15.9868 7.1596 51.1992 20.9464 5.7789 34.7765 7.2495 19.9320 20.0045 13.4604 53.4739 56.4366 31.0616 28.5595 109.7985 3.6178 54.5141 15.5189 9.5866 14.6456 45.4069 14.0874 121.8590 20.7818 110.3279 495.3009 76.0416 25.8846 27.4585 23.8247 15.0910 35.6959 13.3101 20.5605 16.0309 8.1636 24.4045 10.8450 62.3136 46.8534
temp: 298.150 k
press: 1.00000 atm
elementType: 8 7 7 7 6 6 6 6 6 6 6 6 6 6 6 1 1 1 1 1 1 1 1 1 1 1 1 1
symmnumber: 1
zpe: 592324.5 jmol-1
zpe.correction: 0.225604 hartree
zpe.thermalcorrener: 0.239217 hartree
zpe.thermalcorrenthalpy: 0.240161 hartree
zpe.thermalcorrgfe: 0.186065 hartree
zpe.sumelectzpe: -665.405096 hartree
zpe.sumelectthermal: -665.391484 hartree
zpe.sumelectthermalent: -665.390539 hartree
zpe.sumelectthermalfe: -665.444635 hartree
dipole: -0.2890 4.0462 0.2280
dipole: 4.0629
quadrupole: -66.5841 -88.7979 -91.6846
quadrupole: -2.7938 1.6916 -0.9175
quadrupole: 15.7715 -6.4424 -9.3291 -2.7938 1.6916 -0.9175
hfenergy: -665.6307001 hartree
pointgroup: C01 [X(C11H13N3O1)]
dipole: -0.1573367 -1.5897099 -0.0562316 debye
polarizability: 213.3236694|2.3646794|166.5801652|-6.1315944|-0.4452366|73.2725425 unknown
InChI: InChI=1S/C11H13N3O/c1-3-14-7(2)13-10-8(11(14)15)5-4-6-9(10)12/h4-6H,3,12H2,1-2H3
charge 0 multiplicity 1
28 atoms
O  -1.331419 2.341559 0.218253
N  -1.724949 0.027461 0.249094
N  0.047017 -1.580422 0.07012
N  2.689127 -2.218961 -0.161236
C  0.581518 0.844681 0.059894
C  -3.179849 0.338063 0.339023
C  0.969151 -0.525744 0.008482
C  -1.243652 -1.294062 0.187065
C  -0.849277 1.168012 0.177708
C  2.3623 -0.875513 -0.112992
C  1.550983 1.879124 -0.00653
C  -3.816644 0.55698 -1.048583
C  -2.23002 -2.437212 0.268494
C  3.316906 0.170833 -0.17581
C  2.908236 1.527619 -0.12234
H  -3.681032 -0.474753 0.887565
H  -3.264272 1.265671 0.928958
H  1.218198 2.919813 0.034192
H  -3.333765 1.408467 -1.55611
H  -3.720078 -0.337733 -1.689728
H  -4.891724 0.787149 -0.937016
H  -3.032321 -2.355208 -0.486435
H  -2.710423 -2.496972 1.263478
H  -1.673527 -3.369933 0.097823
H  4.381746 -0.074672 -0.267671
H  3.670723 2.312957 -0.173254
H  3.650154 -2.534303 -0.24316
H  1.920792 -2.887207 -0.106485
