program: Gaussian 09
title: 000225419
version: EM64L-G09RevD.01
frameworkgroup: C1[X(C17H20N2O)]
method: RPBEPBE
basis: SDD
operation: Freq
keyword: #p
keyword: freq=noraman
keyword: PBEPBE/SDD
title: #p freq=noraman PBEPBE/SDD
converged: YES YES NO NO
title: Mulliken charges:
elementType: O N N C C C C C C C C C C C C C C C C C H H H H H H H H H H H H H H H H H H H H
charge: -0.235435 -0.147010 -0.047036 -0.163391 0.362854 -0.700704 -0.724270 -0.508478 -0.011549 0.116638 -0.327018 -0.276374 0.408440 0.182563 -0.323538 -0.348974 -0.385195 -0.345403 -0.644613 -0.644916 0.239171 0.205719 0.256929 0.209324 0.223271 0.203637 0.219455 0.271614 0.249619 0.267166 0.242384 0.241145 0.256993 0.267821 0.241559 0.241330 0.221687 0.239091 0.222435 0.243062
chargesum: 0.00000
title: Mulliken charges with hydrogens summed into heavy atoms:
elementType: O N N C C C C C C C C C C C C C C C C C
charge: -0.235435 -0.147010 -0.047036 0.075780 0.362854 -0.028732 -0.077907 -0.236864 -0.011549 0.116638 -0.077399 -0.009208 0.408440 0.182563 -0.081154 -0.107829 -0.128202 -0.077583 0.059962 0.059672
polarizability: 5.89254686e+02 4.02678822e+01 1.89914677e+02 -1.56607764e+01 5.21331419e+00 1.19183019e+02
1716.lowfreq: -10.9824 -5.2423 -2.6007 -0.0011 -0.0007 -0.0006 28.1021 32.2661 43.7011
frequency: 28.0436 32.2200 43.6815 61.2430 76.6059 94.8169 120.9265 126.7726 142.3609 155.2239 193.2955 207.9733 221.7711 231.9653 245.9824 259.5899 281.1508 300.4151 332.6784 340.5117 393.7764 399.7414 422.4884 428.8699 453.3496 472.6322 499.4333 520.0680 533.1691 546.3050 581.8454 621.1559 630.3595 694.7070 703.0370 735.1944 763.7531 774.3970 798.9850 816.4510 827.6445 845.2067 869.1482 913.3238 920.4148 924.8342 938.3195 945.0859 959.8754 960.9372 985.7657 993.2866 1038.8510 1054.5604 1087.9283 1102.9856 1111.1010 1120.8991 1126.8249 1135.7980 1165.2591 1179.1417 1192.7970 1216.5249 1250.9205 1254.5904 1288.1443 1299.7601 1304.0924 1325.7314 1359.0082 1362.9786 1369.6892 1374.1430 1391.8131 1401.8786 1430.1382 1450.4665 1456.2926 1464.0342 1464.9202 1468.7955 1470.7107 1477.6137 1484.8174 1489.7566 1491.1874 1498.3542 1517.5439 1523.7408 1530.8484 1564.1733 1616.0171 1638.2905 2949.9944 2956.7872 2972.7652 2976.3201 2990.6510 3020.3400 3022.8966 3063.8509 3071.2454 3077.0456 3095.3644 3103.0806 3113.2510 3131.9392 3142.2255 3150.2533 3150.9888 3158.0946 3167.0776 3174.5826
redmass: 4.3807 3.7639 3.5995 2.8107 2.9069 4.0213 1.4926 3.5547 3.8319 2.8145 1.2891 3.1486 1.0990 3.1285 1.5818 1.7568 3.8128 3.6732 4.0018 3.8602 3.0122 3.7870 4.7618 3.4210 3.3278 3.7876 3.4742 3.8376 2.4145 4.6666 4.9845 4.2925 4.8936 4.3327 4.7332 4.3616 4.6378 3.0272 1.2956 4.6796 1.9374 2.0864 3.2551 2.0028 1.5149 1.3659 2.7618 1.3958 1.3470 1.4290 2.8281 1.2794 2.5444 1.5098 1.6178 1.2369 1.3303 2.3298 1.4825 1.4932 1.7059 1.6623 1.4761 1.6050 2.0046 2.8705 1.3319 1.7537 1.7455 2.3674 2.5318 2.3817 2.4905 1.3178 1.2285 3.3419 1.1973 2.2187 1.9249 1.4422 1.1217 1.3277 1.1956 1.0495 1.0688 1.0622 1.1571 1.4070 1.8868 5.4869 5.7638 7.1772 6.4423 6.7276 1.0370 1.0392 1.0358 1.0369 1.0810 1.0990 1.1026 1.0994 1.0996 1.0996 1.0995 1.0969 1.0948 1.0861 1.0877 1.0913 1.0876 1.0979 1.0949 1.0963
irintensity: 0.6709 1.1897 0.7691 0.0210 2.3793 1.2314 4.2682 6.8085 1.3104 1.0220 0.7757 0.5877 0.3641 3.6921 2.8937 4.9839 5.9900 3.4730 7.4744 3.3767 1.5381 2.9997 15.1409 26.9343 11.4654 1.7469 15.0906 15.1013 13.8032 13.7667 4.7798 3.1423 7.8756 4.8015 2.6668 13.6499 2.0213 10.5356 21.8925 5.5882 92.8069 17.6885 16.6142 48.7197 16.8925 24.6567 42.7705 10.8841 1.4524 4.0348 0.2435 0.7739 97.8285 24.8435 2.2760 0.4959 2.9751 9.1015 1.9996 67.7996 3.4962 37.0010 7.8468 116.5324 3.6358 24.9355 1.8242 4.4592 11.4577 8.2972 14.4399 25.3925 318.2577 76.7312 11.6494 13.4581 8.0966 398.5259 25.1758 173.5845 45.8168 87.7308 74.1461 26.9755 11.8337 26.6505 0.4799 19.1892 140.7180 61.8263 40.1383 145.1974 549.0590 69.8844 81.6092 227.8130 24.5944 55.9678 5.2748 1.3377 71.0299 9.6552 73.0570 66.5535 20.5380 3.5969 47.1473 1.3337 4.2010 10.9859 5.7810 8.9336 17.0157 21.8807
temp: 298.150 k
press: 1.00000 atm
elementType: 8 7 7 6 6 6 6 6 6 6 6 6 6 6 6 6 6 6 6 6 1 1 1 1 1 1 1 1 1 1 1 1 1 1 1 1 1 1 1 1
symmnumber: 1
zpe: 863779.6 jmol-1
zpe.correction: 0.328996 hartree
zpe.thermalcorrener: 0.348912 hartree
zpe.thermalcorrenthalpy: 0.349856 hartree
zpe.thermalcorrgfe: 0.279731 hartree
zpe.sumelectzpe: -843.043491 hartree
zpe.sumelectthermal: -843.023575 hartree
zpe.sumelectthermalent: -843.022631 hartree
zpe.sumelectthermalfe: -843.092756 hartree
dipole: -10.0807 -0.7466 0.7611
dipole: 10.1369
quadrupole: -92.6571 -119.3690 -121.6046
quadrupole: -16.2881 2.7212 4.5351
quadrupole: 18.5532 -8.1588 -10.3944 -16.2881 2.7212 4.5351
hfenergy: -843.3724871 hartree
pointgroup: C01 [X(C17H20N2O1)]
dipole: 3.963034 0.4427868 -0.0608618 debye
polarizability: 587.2456513|44.3864969|164.3069184|-25.4339873|-36.3499849|146.7998135 unknown
InChI: InChI=1S/C17H20N2O/c1-12(2)16-11-14(7-10-17(16)20)18-13-5-8-15(9-6-13)19(3)4/h5-12H,1-4H3
charge 0 multiplicity 1
40 atoms
O  -4.59503 -2.206543 0.836912
N  5.433182 -0.097494 0.022803
N  -0.139901 0.684162 -0.707821
C  -5.038324 0.490016 -0.05066
C  -3.651239 -0.140801 -0.024652
C  -5.47283 0.86895 1.396346
C  -5.156943 1.705857 -0.994155
C  -2.498941 0.503662 -0.42541
C  -3.554733 -1.542308 0.478745
C  -1.167545 -0.089861 -0.315496
C  -2.216298 -2.166438 0.505204
C  -1.080413 -1.481961 0.144083
C  4.060454 0.081419 -0.132604
C  1.208337 0.418124 -0.47315
C  3.523772 0.791302 -1.260667
C  3.130234 -0.408505 0.845472
C  2.145774 0.975263 -1.401376
C  1.749395 -0.25904 0.671747
C  6.368493 0.463824 -0.963776
C  5.957552 -0.827615 1.186718
H  -5.737052 -0.300793 -0.39012
H  -4.799526 1.639552 1.816725
H  -5.455242 -0.016635 2.05357
H  -6.501789 1.274206 1.391241
H  -4.835919 1.457778 -2.022598
H  -4.546416 2.558093 -0.639446
H  -6.206813 2.048594 -1.035542
H  -2.523214 1.524536 -0.8205
H  -2.185373 -3.2212 0.802132
H  -0.109826 -1.988963 0.122134
H  4.19182 1.210936 -2.017409
H  3.494384 -0.888505 1.758067
H  1.742085 1.535954 -2.250512
H  1.075118 -0.600282 1.464315
H  6.288958 1.567598 -1.023769
H  6.188343 0.050583 -1.976047
H  7.400413 0.212973 -0.674167
H  5.721937 -0.310511 2.138888
H  7.052442 -0.90754 1.105847
H  5.543973 -1.853692 1.241031
