program: Gaussian 09
title: 000225418
version: EM64L-G09RevD.01
frameworkgroup: C1[X(C17H19N3O2)]
method: RPBEPBE
basis: SDD
operation: Freq
keyword: #p
keyword: freq=noraman
keyword: PBEPBE/SDD
title: #p freq=noraman PBEPBE/SDD
converged: YES YES NO NO
title: Mulliken charges:
elementType: O O N N N C C C C C C C C C C C C C C C C C H H H H H H H H H H H H H H H H H H H
charge: -0.235956 -0.242711 -0.152549 -0.114166 -0.425506 0.418006 0.349330 0.036189 -0.517352 -0.351102 -0.378170 -0.007919 -0.811985 0.339377 -0.642705 -0.645249 -0.204376 -0.465817 -0.348785 0.172649 0.205643 -0.781549 0.243797 0.245074 0.249915 0.243638 0.250848 0.230830 0.240503 0.221644 0.238957 0.223062 0.242754 0.236717 0.269250 0.330266 0.256567 0.346350 0.256562 0.222185 0.255784
chargesum: 0.00000
title: Mulliken charges with hydrogens summed into heavy atoms:
elementType: O O N N N C C C C C C C C C C C C C C C C C
charge: -0.235956 -0.242711 -0.152549 -0.114166 -0.079155 0.418006 0.349330 0.036189 -0.273556 -0.106028 -0.128255 -0.007919 -0.086670 0.339377 0.058398 0.057285 0.064874 -0.135551 -0.092217 0.172649 0.205643 -0.047018
polarizability: 5.38386905e+02 -6.33364267e+01 2.41569206e+02 -8.08882685e+00 -5.31645320e+00 1.30465558e+02
1716.lowfreq: -13.6433 -3.7183 -0.0005 -0.0001 0.0009 2.0514 30.3347 32.6773 43.0862
frequency: 30.3099 32.6557 42.9587 57.3934 66.1952 74.9954 83.0603 93.5902 105.5307 115.3732 131.9856 138.8975 170.8417 191.6097 200.9878 208.3457 229.3816 258.7809 287.2335 312.8864 324.2834 336.2512 363.8998 387.0502 406.3083 444.8960 463.4408 480.2895 499.1080 506.4337 536.0768 558.6745 583.3968 586.9189 596.8263 633.1932 651.5883 687.4514 709.1701 737.9698 746.8694 767.8553 808.1364 827.6166 833.3541 843.2239 851.2716 886.8327 915.4629 923.3280 927.6727 946.3012 955.7762 988.3137 997.6890 1015.6135 1039.9817 1041.9927 1056.5401 1096.6606 1103.0489 1110.5118 1124.3852 1157.6717 1181.8555 1201.6636 1209.8108 1227.5502 1247.0606 1257.3649 1281.9967 1300.8159 1343.2384 1360.0018 1371.8013 1386.1461 1387.5844 1402.9117 1428.1256 1434.2442 1451.6202 1458.6650 1464.3610 1467.0182 1467.8753 1475.9919 1476.4361 1484.6832 1491.2104 1496.0292 1498.0956 1513.7756 1533.6356 1537.6196 1574.6425 1613.4938 1622.0054 1637.3448 2947.0599 2954.2803 2983.9571 2997.3878 3017.5859 3020.1012 3063.5361 3088.7198 3096.5038 3101.5906 3103.1431 3111.5506 3136.2910 3146.5239 3147.7576 3161.9356 3174.5431 3199.5052 3355.8633
redmass: 4.4279 4.3529 4.4819 1.2221 2.5082 2.9931 1.8444 2.4677 1.5285 2.8454 4.0529 2.3466 1.5236 2.8636 2.8415 3.9202 4.5386 2.9748 4.3784 4.3286 4.1253 5.1543 4.3903 4.2643 4.3605 3.1626 4.8839 3.7360 4.5646 4.0756 3.6589 4.2749 3.1363 3.2449 4.5190 5.2832 3.6805 5.2930 4.0491 4.9091 5.3432 4.5347 1.6530 2.7590 2.0826 1.1332 1.5359 5.5010 2.7837 1.4876 4.8181 1.4423 2.0048 1.2830 1.6581 1.6283 1.4945 1.6430 1.5213 1.8779 1.2372 1.3314 1.9067 1.5235 2.4494 1.8302 1.9194 1.6931 2.7621 3.6312 1.5199 3.3134 2.1366 3.1774 4.1992 3.5047 1.2171 1.2146 1.7590 1.3520 1.0483 1.2706 1.0439 1.1543 1.1063 1.2328 1.0522 4.5878 1.1984 2.5790 1.6732 1.5308 5.9840 6.5949 6.4508 5.5258 6.6067 7.2894 1.0376 1.0395 1.0378 1.0357 1.0984 1.1022 1.0966 1.0991 1.0981 1.0967 1.1009 1.0947 1.0861 1.0885 1.0897 1.0992 1.0954 1.0931 1.0765
irintensity: 1.4071 0.2382 2.8799 1.8144 0.2804 4.7222 2.8468 3.5396 3.2828 1.4273 3.6856 5.1456 0.5742 4.4689 1.3785 2.7928 0.4311 0.5598 5.7483 3.7451 14.5044 1.7498 14.7982 16.1251 15.0978 10.1030 27.3925 42.3004 13.5083 7.7375 5.8368 9.3700 0.8082 24.7263 0.7207 14.9712 3.0872 2.7507 9.5685 3.9071 25.3746 5.9395 29.2950 10.3921 18.6100 48.8319 42.8461 47.5005 6.6150 56.7538 20.3011 5.4912 9.2186 0.8563 15.4042 4.8418 8.4866 15.7578 24.0686 18.5386 0.7590 6.1300 31.4478 0.7079 24.4128 29.6236 24.2316 63.1277 91.7273 31.8670 46.1528 55.0206 53.9731 195.2722 175.5235 34.7345 74.0826 19.1540 45.6610 16.4432 19.0108 75.6778 0.3833 59.6430 35.0104 31.5135 28.6439 720.5085 8.3407 742.6883 24.3490 129.5818 52.1959 57.6742 76.9081 39.7286 673.0194 31.5815 86.3221 213.5589 18.3278 7.7060 2.0033 71.1024 13.2103 9.5711 8.4747 3.6086 17.2107 47.6749 0.0635 12.2455 8.0334 9.6905 21.5607 8.3534 114.2381
temp: 298.150 k
press: 1.00000 atm
elementType: 8 8 7 7 7 6 6 6 6 6 6 6 6 6 6 6 6 6 6 6 6 6 1 1 1 1 1 1 1 1 1 1 1 1 1 1 1 1 1 1 1
symmnumber: 1
zpe: 857643.9 jmol-1
zpe.correction: 0.326659 hartree
zpe.thermalcorrener: 0.348732 hartree
zpe.thermalcorrenthalpy: 0.349676 hartree
zpe.thermalcorrgfe: 0.274008 hartree
zpe.sumelectzpe: -972.308614 hartree
zpe.sumelectthermal: -972.286541 hartree
zpe.sumelectthermalent: -972.285597 hartree
zpe.sumelectthermalfe: -972.361264 hartree
dipole: -13.5373 3.3136 0.5059
dipole: 13.9461
quadrupole: -137.4077 -128.0161 -127.7953
quadrupole: 18.0959 2.3289 -5.5224
quadrupole: -6.3346 3.0569 3.2777 18.0959 2.3289 -5.5224
hfenergy: -972.6352729 hartree
pointgroup: C01 [X(C17H19N3O2)]
dipole: 5.2482167 -1.4026975 -0.7705263 debye
polarizability: 530.7478436|-69.4120957|201.3160371|-38.6711611|58.2575293|178.3577879 unknown
InChI: InChI=1S/C17H19N3O2/c1-11-9-13(20(3)4)5-7-15(11)19-16-8-6-14(22)10-17(16)18-12(2)21/h5-10,18H,1-4H3
charge 0 multiplicity 1
41 atoms
O  -4.254493 3.002972 1.714038
O  -5.247345 -1.297997 -0.527141
N  5.265596 -0.340459 -0.244588
N  -0.407886 -0.365626 -0.361783
N  -2.914798 -1.084721 -0.610048
C  3.871368 -0.365449 -0.241493
C  1.716602 -0.147674 1.001809
C  0.988513 -0.329748 -0.230469
C  3.125359 -0.184042 0.966535
C  3.128724 -0.613718 -1.443752
C  1.732702 -0.62769 -1.414366
C  -1.272063 0.49558 0.178742
C  1.031552 -0.064929 2.358453
C  -2.714939 0.137973 0.05115
C  6.005648 -0.598325 -1.488812
C  6.004789 -0.097838 1.002529
C  -0.943472 1.788785 0.780575
C  -3.703352 0.954906 0.572109
C  -1.925681 2.616922 1.25956
C  -3.360504 2.226397 1.219002
C  -4.116344 -1.740525 -0.883303
C  -3.963703 -3.048364 -1.65588
H  3.655229 -0.09362 1.919836
H  3.642054 -0.806916 -2.388975
H  1.165713 -0.831762 -2.328482
H  0.847255 0.976542 2.679896
H  0.053492 -0.575537 2.356449
H  1.661845 -0.539628 3.130683
H  5.742192 0.134035 -2.277471
H  7.086127 -0.513078 -1.296151
H  5.808215 -1.61521 -1.883708
H  7.083009 -0.048037 0.785802
H  5.706433 0.86174 1.468241
H  5.842561 -0.905569 1.745471
H  0.106846 2.098611 0.7745
H  -4.755857 0.673372 0.506541
H  -1.703367 3.607688 1.671623
H  -2.017064 -1.494745 -0.918212
H  -4.45089 -3.859151 -1.087632
H  -2.91413 -3.326669 -1.851333
H  -4.495737 -2.960797 -2.619345
