program: Gaussian 09
title: 000225392
version: EM64L-G09RevD.01
frameworkgroup: C1[X(C13H24O3)]
method: RPBEPBE
basis: SDD
operation: Freq
keyword: #pfreq=noraman
keyword: PBEPBE/SDD
title: #p freq=noraman PBEPBE/SDD
converged: NO YES NO NO
title: Mulliken charges:
elementType: O O O C C C C C C C C C C C C C H H H H H H H H H H H H H H H H H H H H H H H H
charge: -0.266030 -0.242214 -0.226665 -0.118734 -0.009624 -0.110950 -0.445977 -0.405846 -0.435336 0.036030 -0.321742 -0.415906 -0.361419 -0.350831 -0.700113 -0.691522 0.220132 0.184260 0.229943 0.226197 0.239671 0.202793 0.206968 0.221406 0.191930 0.179154 0.219494 0.213906 0.209186 0.216646 0.187069 0.229556 0.224689 0.186628 0.206063 0.213558 0.218550 0.213167 0.209086 0.216826
chargesum: 0.00000
title: Mulliken charges with hydrogens summed into heavy atoms:
elementType: O O O C C C C C C C C C C C C C
charge: -0.266030 -0.242214 -0.226665 0.101397 0.174637 0.118993 0.019892 0.003916 -0.022000 0.215184 0.111658 0.009925 0.055206 0.060485 -0.061942 -0.052442
polarizability: 1.66184800e+02 6.79304431e-01 1.51520554e+02 -3.42681070e+00 -5.08121978e-01 1.22896133e+02
1716.lowfreq: -3.8834 -0.0007 -0.0005 0.0001 6.6583 15.4430 44.7409 50.8876 65.0565
frequency: 44.3364 50.6721 65.0229 73.5277 80.0618 88.3910 133.1410 152.2603 184.0884 200.4840 229.5459 236.2378 244.2645 252.0450 278.3479 282.1771 324.0302 339.4129 377.7433 429.7724 468.0148 500.8666 510.9642 527.3227 614.7032 669.5177 714.8792 726.8216 744.5577 779.4130 792.6380 828.6236 840.0445 860.6829 888.4676 891.8015 896.6743 912.9504 916.5420 935.8762 949.3059 956.1981 1025.3413 1040.7474 1051.2601 1055.0977 1069.5103 1083.6190 1086.2624 1102.4382 1112.8844 1121.6771 1142.0529 1155.6982 1173.1207 1175.5252 1201.5669 1227.3047 1238.1381 1244.1012 1263.4061 1265.5334 1272.9257 1276.6098 1284.2741 1289.9400 1297.9830 1313.6864 1323.3136 1333.5194 1342.8288 1347.6125 1352.6219 1359.9993 1363.6767 1373.2228 1384.7508 1389.7391 1391.5400 1449.1868 1453.5524 1453.9889 1462.6832 1473.6957 1475.4033 1476.0564 1477.8594 1478.0782 1485.7047 1486.9411 2871.8613 2885.7238 2967.7560 2969.3629 2972.0633 2972.3116 2973.8365 2974.3810 2981.7508 2983.4838 2996.6165 3001.7353 3006.5537 3024.4919 3031.2226 3041.4313 3045.3026 3061.7554 3062.6273 3070.4602 3072.5449 3073.4888 3076.5205 3094.6288
redmass: 2.8714 3.0578 1.8088 1.7772 2.8269 3.1578 3.0647 3.3218 3.3053 3.2037 1.1215 1.1106 3.0491 3.4692 2.9116 2.7738 3.2790 2.6355 5.1509 4.2055 3.2348 3.6049 2.5259 2.9953 4.5795 3.1716 2.5747 1.6101 1.1374 2.2471 1.8303 3.4146 3.6278 1.5281 1.6804 2.1777 1.8557 2.1913 1.7555 2.3538 2.9619 3.2652 1.9567 2.2146 2.7375 2.2594 2.5094 2.3649 1.8733 2.9298 2.0590 2.0683 2.2777 2.7143 1.4660 1.9399 1.3867 1.3350 1.3214 1.2755 1.2478 1.2841 1.2869 1.2183 1.0965 1.1531 1.2384 1.2500 1.2545 1.4081 1.3694 1.4222 1.4241 1.3779 1.5261 1.4359 1.5788 1.2189 1.3255 1.0824 1.0914 1.0835 1.0860 1.0576 1.0880 1.0548 1.0424 1.0426 1.0765 1.0798 1.0828 1.0821 1.0767 1.0596 1.0432 1.0439 1.0561 1.0649 1.0602 1.0842 1.0618 1.0598 1.0648 1.0937 1.0957 1.0991 1.1010 1.1015 1.1019 1.1009 1.0994 1.0992 1.1020 1.1045
irintensity: 0.2625 0.1661 0.1387 0.0422 0.0653 0.8892 0.8099 4.5423 1.2704 3.0974 0.0077 0.0418 2.0935 2.0614 0.0384 1.4811 0.7661 12.8699 2.6391 1.3701 1.5530 1.2137 3.3861 1.6346 3.5026 2.1055 3.0461 10.3736 4.2997 22.1984 15.4300 42.0288 70.9181 20.8326 23.5792 42.6922 33.6285 19.7667 31.5934 11.1852 43.7471 89.7951 12.4591 20.0397 28.7752 33.7117 18.3624 81.9534 11.4484 28.1286 20.0346 24.7449 8.2041 31.1295 3.6626 8.2594 1.8783 2.3884 3.8679 15.6180 5.4626 3.4660 0.2115 2.2491 0.2607 8.2030 11.1145 26.2470 24.9519 5.3602 1.9506 1.8070 5.1297 7.3800 4.4343 2.1040 19.6560 12.2401 0.8314 2.8210 8.9515 6.6446 9.4470 5.4030 7.3558 1.4042 6.9578 17.5037 7.9518 17.0891 41.3880 79.2842 19.5600 11.3008 43.4159 36.8751 3.2458 90.8204 32.8020 58.1574 27.9146 22.5152 34.6547 6.2757 1.6583 30.2145 17.0446 0.9450 42.6678 82.4451 41.5503 61.6802 94.2071 39.0523
temp: 298.150 k
press: 1.00000 atm
elementType: 8 8 8 6 6 6 6 6 6 6 6 6 6 6 6 6 1 1 1 1 1 1 1 1 1 1 1 1 1 1 1 1 1 1 1 1 1 1 1 1
symmnumber: 1
zpe: 926573.7 jmol-1
zpe.correction: 0.352913 hartree
zpe.thermalcorrener: 0.370190 hartree
zpe.thermalcorrenthalpy: 0.371134 hartree
zpe.thermalcorrgfe: 0.307626 hartree
zpe.sumelectzpe: -734.130867 hartree
zpe.sumelectthermal: -734.113591 hartree
zpe.sumelectthermalent: -734.112646 hartree
zpe.sumelectthermalfe: -734.176154 hartree
dipole: 0.4116 2.0438 0.1865
dipole: 2.0932
quadrupole: -99.5306 -100.0325 -97.1433
quadrupole: -5.7902 -6.7839 -2.7889
quadrupole: -0.6285 -1.1303 1.7588 -5.7902 -6.7839 -2.7889
hfenergy: -734.4837801 hartree
pointgroup: C01 [X(C13H24O3)]
dipole: 0.1981386 0.7979478 0.0471757 debye
polarizability: 166.1883712|-0.0970823|151.437632|-3.6153209|-1.2629813|122.9754842 unknown
InChI: InChI=1S/C13H24O3/c1-3-6-11-10-8-5-9-14-13(10)16-12(15-11)7-4-2/h10-13H,3-9H2,1-2H3
charge 0 multiplicity 1
40 atoms
O  0.964031 0.074544 0.112298
O  -0.761987 -1.57069 -0.274578
O  -2.985373 -0.995162 -0.835007
C  -1.339979 0.843264 -0.405051
C  0.177415 1.131602 -0.574037
C  -1.624641 -0.574673 -0.973048
C  -1.851762 0.952883 1.051435
C  -3.3229 0.481672 1.144797
C  0.651258 2.480192 -0.018368
C  0.656231 -1.243327 -0.447901
C  -3.471666 -0.935733 0.57011
C  1.48305 -2.29061 0.286685
C  2.095971 2.831422 -0.438602
C  3.000669 -2.139207 0.040079
C  2.579736 4.16829 0.161222
C  3.824824 -3.191903 0.811054
H  -1.898702 1.562444 -1.04067
H  0.415344 1.077899 -1.66553
H  -1.41156 -0.622418 -2.061983
H  -1.767453 1.997314 1.404359
H  -1.212894 0.329552 1.704426
H  -3.663479 0.485327 2.198536
H  -3.978342 1.174484 0.581064
H  0.585299 2.452162 1.086233
H  -0.044578 3.271506 -0.366105
H  0.879422 -1.215179 -1.544687
H  -2.90232 -1.66966 1.171447
H  -4.525089 -1.251028 0.502398
H  1.136129 -3.287854 -0.043802
H  1.258836 -2.204225 1.366601
H  2.152761 2.878504 -1.545814
H  2.765378 2.0094 -0.122481
H  3.312284 -1.120401 0.337253
H  3.208325 -2.230178 -1.046041
H  1.931452 5.007382 -0.156017
H  2.566465 4.133925 1.266942
H  3.612618 4.40159 -0.155862
H  3.659634 -3.102547 1.901308
H  3.540926 -4.21883 0.512361
H  4.90737 -3.072034 0.622476
