program: Gaussian 09
title: 000225376
version: EM64L-G09RevD.01
frameworkgroup: C1[X(C8H13NO)]
method: RPBEPBE
basis: SDD
operation: Freq
keyword: #p
keyword: freq=noraman
keyword: PBEPBE/SDD
title: #p freq=noraman PBEPBE/SDD
converged: NO YES NO NO
title: Mulliken charges:
elementType: O N C C C C C C C C H H H H H H H H H H H H H
charge: -0.275368 -0.334724 -0.056777 -0.165995 -0.472735 -0.439589 -0.431929 -0.421212 -0.421025 0.119008 0.204364 0.242039 0.211583 0.215053 0.203264 0.200470 0.200288 0.235347 0.232299 0.200273 0.217476 0.224272 0.313618
chargesum: 0.00000
title: Mulliken charges with hydrogens summed into heavy atoms:
elementType: O N C C C C C C C C
charge: -0.275368 -0.021106 0.147588 0.076044 -0.046099 -0.035854 0.003706 0.011359 0.020723 0.119008
polarizability: 9.44103730e+01 -5.10328185e+00 9.09874624e+01 -8.47524542e-01 -2.65745186e+00 7.73846245e+01
1716.lowfreq: -28.0223 0.0004 0.0008 0.0008 9.4289 28.2373 97.6770 154.2800 205.0850
frequency: 97.4591 154.2715 205.0452 270.5666 339.0349 362.6001 394.7471 431.1311 477.2054 565.8540 574.4642 635.3828 702.5754 743.3665 768.0640 793.6215 833.2682 858.6323 879.6243 927.1133 945.7181 963.5669 1013.8273 1043.3552 1059.6059 1082.9307 1092.7450 1116.3393 1142.0613 1148.0573 1181.8827 1238.2195 1252.1900 1274.3561 1285.8675 1303.1794 1321.0148 1328.5344 1339.9376 1348.4758 1354.2665 1357.1705 1382.2055 1433.0649 1457.5965 1460.9759 1472.7111 1479.7620 1492.8835 1622.4668 2948.1563 2963.7794 2976.7702 2980.2918 2988.1932 2996.8128 3006.4885 3022.5540 3038.9165 3039.6524 3044.0882 3055.7790 3502.7842
redmass: 4.5506 3.0678 2.8386 2.0523 2.1312 3.6771 1.9282 4.3181 2.9982 2.9034 3.5270 1.5822 2.9306 3.9446 2.8673 1.9225 2.8088 1.5960 2.1846 2.2254 1.6954 2.2278 2.7138 2.0176 1.6045 1.8704 1.6039 1.0346 1.4324 1.3901 1.5916 1.1929 1.2171 1.5854 1.7065 1.9061 1.5086 1.3202 1.5679 1.4344 1.4933 1.4903 1.6384 2.0477 1.0869 1.0840 1.0835 1.1215 1.1333 4.9552 1.0609 1.0611 1.0631 1.0616 1.0634 1.0991 1.0858 1.0985 1.0953 1.0983 1.0955 1.1018 1.0756
irintensity: 2.8176 0.0915 0.6429 1.0154 1.9293 1.9056 0.6180 8.2682 6.7876 10.1033 5.1201 51.7896 39.5011 15.7893 3.4147 0.7707 1.9516 4.2863 2.7400 6.5821 1.9965 3.4440 5.3729 23.7240 2.5868 0.6939 1.0371 2.3192 20.8077 9.9398 3.1032 12.4083 2.0042 3.1302 1.2908 32.6161 3.9696 1.9704 24.8561 2.6440 3.9075 5.7564 16.8947 12.4346 13.5814 8.2526 20.1872 14.7941 15.4592 301.1479 62.6748 31.0484 30.6958 38.1548 36.5231 26.4046 91.3444 59.5755 9.5535 44.9882 39.6701 53.3025 12.6611
temp: 298.150 k
press: 1.00000 atm
elementType: 8 7 6 6 6 6 6 6 6 6 1 1 1 1 1 1 1 1 1 1 1 1 1
symmnumber: 1
zpe: 529785.8 jmol-1
zpe.correction: 0.201785 hartree
zpe.thermalcorrener: 0.210157 hartree
zpe.thermalcorrenthalpy: 0.211101 hartree
zpe.thermalcorrgfe: 0.168958 hartree
zpe.sumelectzpe: -441.863200 hartree
zpe.sumelectthermal: -441.854828 hartree
zpe.sumelectthermalent: -441.853884 hartree
zpe.sumelectthermalfe: -441.896028 hartree
dipole: -4.1683 2.0250 0.2952
dipole: 4.6435
quadrupole: -72.8037 -55.7202 -58.5228
quadrupole: 3.8799 0.4685 -2.4514
quadrupole: -10.4548 6.6287 3.8261 3.8799 0.4685 -2.4514
hfenergy: -442.0649851 hartree
pointgroup: C01 [X(C8H13N1O1)]
dipole: 1.6386877 -0.7945376 0.1449566 debye
dipolederiv: -1.1345295 0.3354084 -0.0587303 0.1817153 -0.6143159 -0.0824332 -0.2212154 -0.0092633 -0.436727 -0.5461648 0.1943749 0.0721042 0.3906482 -0.8360207 -0.0286651 0.266741 -0.1611631 -0.4100041 0.1114733 0.0259948 0.0271275 0.0039602 0.0894289 -0.0348114 0.0115981 -0.0265721 0.0601176 -0.0834283 -0.1173973 -0.0884537 -0.1342392 -0.0329332 -0.0698195 -0.0825186 -0.0377825 0.0347054 0.0543016 0.0413627 0.0192313 0.0238464 0.0230806 -0.0163848 0.0111035 -0.0171534 0.0968517 0.1146305 -0.00733 0.0101481 0.026391 0.0553275 0.0286728 0.0112291 0.0449513 0.08495 0.1027425 0.0575248 0.0152857 0.0615906 0.1274438 0.0341468 -0.0305128 -0.0228597 0.061355 0.0635629 0.0343666 0.0432103 0.0378297 0.0636735 0.0178968 0.0270592 -0.002602 0.06512 0.4003089 -0.2319545 -0.0327184 -0.1248512 0.3061348 -0.0847615 -0.0055182 -0.1256626 0.2351239 1.232397 -0.3941371 0.1117764 -0.5177213 1.0416345 0.3466188 0.1389284 0.43691 0.3375776 -0.0782666 0.1056782 -0.0613531 0.1006642 -0.0767255 0.0730548 -0.0639467 0.073936 0.0172158 -0.0317089 0.0622094 0.0869573 0.053768 0.0273298 -0.050246 0.0662671 -0.0517955 -0.0292357 -0.0522537 -0.0649753 -0.1320149 -0.0759766 -0.006562 -0.1200842 -0.0888208 -0.071695 -0.0256516 0.0007397 -0.058209 0.1029708 -0.0455613 -0.0607069 0.137975 0.0707284 0.0921631 -0.0367041 -0.023421 0.0621573 0.0895359 0.1072004 -0.0232555 -0.0814145 0.1360024 -0.0655369 -0.0765521 -0.0589207 -0.0600362 -0.0859075 -0.1112636 -0.0128248 -0.0430047 -0.1434885 -0.0410347 -0.0318582 -0.0364598 -0.1334886 -0.0786477 -0.0765474 -0.0215966 -0.0773232 -0.0477261 -0.1004802 -0.05631 -0.0238287 0.1316997 -0.0350699 0.0785279 -0.0374849 0.0575226 -0.0338947 0.0797008 0.0228235 -0.013267 -0.0052394 -0.1076294 -0.0083265 0.019612 -0.1033142 -0.0866166 -0.069326 -0.0455051 -0.0305452 -0.1010152 0.0938641 -0.0935622 -0.0790015 0.1142377 0.0778185 0.0943849 -0.0005057 -0.03624 0.0997422 0.0670025 0.0586897 0.0430462 -0.0269274 0.0888611 -0.0986284 -0.1300934 -0.0337655 -0.0074984 0.0195765 0.0174423 -0.1736864 0.0808925 -0.0234 0.1648389 0.0218155 0.1026436 0.0307621 -0.0782654 0.0457752 0.1784022 -0.0718281 -0.0786785 -0.0853297 0.2414911 unknown
polarizability: 94.3858591|-5.1758365|90.8834942|1.1837704|2.7296352|77.5131065 unknown
InChI: InChI=1S/C8H13NO/c10-8-7-3-1-2-6(4-7)5-9-8/h6-7,9H,1-5H2
charge 0 multiplicity 1
23 atoms
O  -2.63948 0.387274 -0.362445
N  -0.980346 -1.207077 -0.619417
C  1.299747 -0.932382 0.434201
C  -0.521153 0.747583 0.842118
C  0.490451 -0.19935 1.531352
C  2.072706 0.10061 -0.434011
C  0.234859 1.828678 0.009563
C  1.154708 1.184054 -1.055382
C  0.336379 -1.838585 -0.375892
C  -1.472738 -0.029374 -0.076906
H  2.042364 -1.605035 0.906595
H  -1.161888 1.255299 1.585041
H  1.171339 0.387172 2.178437
H  -0.035661 -0.92727 2.179273
H  2.636292 -0.424171 -1.230758
H  2.824945 0.59351 0.216159
H  0.842805 2.438523 0.708547
H  -0.496033 2.504976 -0.470207
H  0.533005 0.732873 -1.852206
H  1.773475 1.963052 -1.540451
H  0.798274 -2.100369 -1.349346
H  0.181186 -2.787865 0.178434
H  -1.641436 -1.701627 -1.226999
