program: Gaussian 09
title: 000225360
version: EM64L-G09RevD.01
frameworkgroup: C1[X(C8H9NO3)]
method: RPBEPBE
basis: SDD
operation: Freq
keyword: #pfreq=noraman
keyword: PBEPBE/SDD
title: #p freq=noraman PBEPBE/SDD
converged: NO YES NO NO
title: Mulliken charges:
elementType: O O O N C C C C C C C C H H H H H H H H H
charge: -0.195298 -0.305083 -0.188281 0.048330 0.173015 0.206783 -0.321628 -0.756472 -0.729503 -0.253065 0.200670 -0.146273 0.272599 0.233509 0.233507 0.263561 0.253349 0.229398 0.253339 0.259475 0.268068
chargesum: 0.00000
title: Mulliken charges with hydrogens summed into heavy atoms:
elementType: O O O N C C C C C C C C
charge: -0.195298 -0.305083 -0.188281 0.048330 0.173015 0.206783 -0.049029 -0.025895 0.006582 0.006410 0.200670 0.121795
polarizability: 1.72773999e+02 -1.62052607e+00 1.06429890e+02 -2.16714455e-02 -1.34117213e-02 5.26661736e+01
1716.lowfreq: -10.2549 -3.2507 -0.0008 -0.0008 -0.0007 5.4906 17.2142 52.0254 63.1266
frequency: 17.2074 51.9801 62.9742 77.5387 89.7309 178.4149 188.6144 203.7150 256.1071 305.6059 309.5230 400.3213 452.0198 487.8077 567.6451 584.3300 592.5652 711.1532 733.4590 751.8625 835.6306 836.7960 847.4858 869.7182 889.9244 896.5301 955.3957 967.7121 974.7124 1027.6552 1051.4676 1063.5852 1086.3031 1144.9483 1210.4713 1247.2055 1276.8202 1367.4437 1382.9411 1393.5463 1447.7114 1455.1015 1459.3075 1462.5689 1466.9796 1544.9927 1604.1969 1686.4003 2980.7579 2993.7908 3061.1413 3076.8659 3111.9471 3117.1159 3228.4586 3248.6739 3271.6306
redmass: 3.1847 2.5193 1.3602 4.2848 5.3507 3.7700 4.6634 1.2351 4.5074 3.8118 6.2750 2.8839 6.7885 3.1365 6.1361 5.9677 3.0780 6.8786 8.5231 1.2476 5.8181 1.3336 5.4696 6.7249 5.0171 1.3939 1.2517 2.3957 1.7590 1.6422 2.5322 1.8426 1.6753 1.7865 1.5745 8.0426 4.4597 2.6314 1.2213 1.2245 1.1278 5.2791 1.0463 1.0489 1.0739 6.2631 5.9459 12.3940 1.0369 1.0365 1.0977 1.0967 1.1008 1.0991 1.0917 1.0995 1.1085
irintensity: 0.0150 0.5171 0.9513 1.5075 1.9042 0.0579 1.9623 0.2569 3.5236 1.6045 0.3234 0.3769 1.7373 0.6885 8.4251 13.1128 1.6184 12.5783 26.0615 89.8225 91.7305 14.9556 52.2175 8.5297 35.4800 1.0027 0.0125 337.8489 87.0777 140.6858 43.3039 5.8273 6.5334 27.7196 4.0525 122.6084 31.5270 4.3222 47.2914 12.6987 23.5774 99.6589 24.9381 10.0079 3.3507 37.1280 25.1283 240.6710 17.8158 10.7650 15.1573 10.5805 16.5664 16.7222 3.2914 0.0150 0.0693
temp: 298.150 k
press: 1.00000 atm
elementType: 8 8 8 7 6 6 6 6 6 6 6 6 1 1 1 1 1 1 1 1 1
symmnumber: 1
zpe: 410118.8 jmol-1
zpe.correction: 0.156206 hartree
zpe.thermalcorrener: 0.168507 hartree
zpe.thermalcorrenthalpy: 0.169451 hartree
zpe.thermalcorrgfe: 0.115425 hartree
zpe.sumelectzpe: -589.712323 hartree
zpe.sumelectthermal: -589.700023 hartree
zpe.sumelectthermalent: -589.699079 hartree
zpe.sumelectthermalfe: -589.753105 hartree
dipole: 0.7728 5.5533 0.0005
dipole: 5.6069
quadrupole: -44.1836 -74.4775 -70.9460
quadrupole: -0.5497 -0.0040 -0.0005
quadrupole: 19.0188 -11.2751 -7.7437 -0.5497 -0.0040 -0.0005
hfenergy: -589.8685294 hartree
pointgroup: C01 [X(C8H9N1O3)]
dipole: -0.2735058 2.1888846 -0.0006932 debye
dipolederiv: -0.1244786 0.0370728 0.000115 0.0187403 -0.5756963 -0.0002384 0.0003318 -0.0000569 -0.1138533 -2.2214754 0.3638755 -0.0003616 0.2151754 -0.5018734 -0.0003213 -0.0018065 0.0004386 -0.1540035 -0.6362624 -0.0911808 0.0002257 0.155766 -1.0613588 0.0010716 0.0004733 -0.0010217 -0.2932479 0.7370645 -0.0834466 0.0005272 0.6157803 -0.2766912 0.0002505 0.0009152 0.0000179 -0.1543418 -0.5352067 -0.3463909 0.0001581 -0.6255128 -0.0322461 0.0006265 0.000584 0.0004816 0.0008474 0.3552861 0.0759909 0.0002866 -0.1463353 0.4576362 0.0000254 0.0001406 0.000098 -0.0088389 0.2738645 0.0321975 -0.00052 0.2191187 -0.0118735 -0.0001834 -0.0002742 0.0001274 -0.1458872 -0.2464662 -0.0592068 -0.0001781 0.0877318 -0.0502883 0.0000066 -0.0001633 -0.0000723 0.0660983 0.0117275 -0.1711365 -0.0000106 -0.098158 -0.2459898 -0.0000699 0.0000382 -0.0001769 0.0700239 -0.2965739 0.0482078 -0.0000317 0.244845 -0.0156885 -0.0002029 0.0001984 -0.0000334 -0.2071983 2.5011031 0.0456204 -0.0005549 -0.5913121 1.5465945 -0.0011747 -0.0008691 0.00006 0.2887341 -0.0907903 -0.00433 -0.000274 -0.2127156 0.3225838 0.0003114 -0.0000383 0.0001862 -0.0972161 0.0707722 0.0747448 0.0002258 0.0953342 0.0787409 -0.0001118 0.0002537 -0.0001186 0.1848084 -0.0291841 0.0268652 0.062503 0.0135074 0.0846647 -0.0901122 0.1108885 -0.066487 -0.0326091 -0.0289108 0.0267403 -0.0624399 0.013388 0.0846574 0.0901416 -0.1109324 0.0665175 -0.032883 0.13121 0.0242641 -0.0000164 -0.0414549 -0.0856569 -0.0000215 -0.0000037 0.0000301 0.1279547 0.0761174 -0.0364442 0.0973684 -0.0041444 0.0608937 0.011487 0.0735085 0.053216 -0.0141692 -0.1129679 0.1280395 -0.0002283 0.100926 0.04095 0.0000889 -0.0002612 0.0001618 0.1129458 0.0764837 -0.0363354 -0.0972074 -0.0040716 0.0608619 -0.0115105 -0.0733237 -0.0533088 -0.0145214 0.0533699 -0.0752731 0.0001494 -0.0878497 0.0291922 0.0000607 0.0001228 0.0000497 0.2009867 0.0353174 0.0201253 0.0002639 0.0312413 0.0905875 -0.0001236 0.0002174 -0.000109 0.2163704 unknown
polarizability: 172.8063001|0.6940852|106.3975877|-0.0312712|0.0010733|52.6661744 unknown
InChI: InChI=1S/C8H9NO3/c1-6(2)9-12-8(10)7-4-3-5-11-7/h3-5H,1-2H3
charge 0 multiplicity 1
21 atoms
O  2.720413 -0.888757 -0.00102
O  -0.80721 0.023365 0.001936
O  0.151278 -2.158653 0.000987
N  -2.146474 -0.650453 0.000779
C  1.517528 -0.150367 0.001132
C  -3.081236 0.275318 -0.000115
C  1.809778 1.211871 0.001068
C  -4.49589 -0.262201 -0.001213
C  -2.854971 1.771943 -0.00009
C  3.244819 1.338373 -0.000976
C  0.266046 -0.923201 0.002845
C  3.756971 0.046975 -0.002206
H  1.073602 2.011587 0.002442
H  -5.04354 0.099574 0.889401
H  -5.042136 0.099513 -0.892712
H  -4.498113 -1.36348 -0.001164
H  -2.267291 2.075054 -0.885579
H  -3.813582 2.314431 -0.001227
H  -2.269276 2.07532 0.886626
H  3.823232 2.259526 -0.001483
H  4.761051 -0.367536 -0.003831
