program: Gaussian 09
title: 000225353
version: EM64L-G09RevD.01
frameworkgroup: C1[X(C7H8N4)]
method: RPBEPBE
basis: SDD
operation: Freq
keyword: #p
keyword: freq=noraman
keyword: PBEPBE/SDD
title: #p freq=noraman PBEPBE/SDD
converged: YES YES NO NO
title: Mulliken charges:
elementType: N N N N C C C C C C C H H H H H H H H
charge: -0.154903 -0.064268 -0.016006 -0.008442 -0.342777 0.132857 0.042809 -0.216915 -0.655582 -0.311343 -0.355306 0.250724 0.216869 0.268315 0.222521 0.225343 0.252735 0.263651 0.249720
chargesum: 0.00000
title: Mulliken charges with hydrogens summed into heavy atoms:
elementType: N N N N C C C C C C C
charge: -0.154903 -0.064268 -0.016006 -0.008442 0.124816 0.132857 0.042809 0.051400 0.045017 -0.047693 -0.105586
polarizability: 1.29634940e+02 9.06706640e+00 1.05780953e+02 -5.95673996e+00 3.54543626e+00 5.33752524e+01
1716.lowfreq: -11.5241 -4.4593 -0.0001 0.0006 0.0011 9.1642 41.8111 97.2199 183.6068
frequency: 41.3320 97.2197 183.6049 219.7295 228.5726 266.7401 390.2845 416.0495 483.0203 527.2971 601.9097 620.6644 641.0850 692.8641 759.0200 792.2473 795.9725 844.0210 860.9736 904.5081 947.2437 957.2932 1051.2494 1067.2340 1091.3243 1120.4228 1171.8164 1205.8560 1259.6060 1271.3285 1278.0642 1332.2487 1345.9916 1356.5023 1373.6616 1395.7914 1409.6779 1445.8775 1470.3649 1478.8535 1486.4005 1528.0809 1566.5896 2994.7294 3020.1318 3075.2672 3094.7360 3108.6279 3154.0867 3174.5605 3224.0171
redmass: 2.4796 4.2509 1.5965 3.9167 4.5727 1.5227 3.6374 4.6633 4.4230 6.0816 5.0066 3.9962 4.7844 5.6337 4.0689 1.5543 3.4852 1.4999 5.6113 1.5133 1.5036 2.3188 2.7210 3.4090 1.9812 3.8545 2.4720 1.9659 1.8385 8.1420 2.1546 2.6042 1.5922 1.4952 2.5587 1.2131 1.9668 2.1222 1.0636 1.3829 1.0793 8.1902 7.3419 1.0357 1.0601 1.1037 1.0998 1.1027 1.0933 1.0929 1.0984
irintensity: 0.1189 0.5622 1.8490 0.7472 0.3447 1.4707 0.9464 1.6450 7.6692 4.3226 0.4013 2.2604 20.1879 0.7342 11.8412 11.5402 14.0226 8.5516 11.7366 26.8045 0.6523 8.8614 3.5435 18.2155 8.5111 5.8134 25.7685 46.7358 0.5961 17.3439 46.6005 23.8381 45.5138 5.5664 18.5439 19.4037 0.6247 56.6954 12.3574 28.1051 19.3758 19.5431 62.0024 19.2255 29.0850 1.6575 34.8808 23.7851 11.6157 11.6850 0.3497
temp: 298.150 k
press: 1.00000 atm
elementType: 7 7 7 7 6 6 6 6 6 6 6 1 1 1 1 1 1 1 1
symmnumber: 1
zpe: 387738.1 jmol-1
zpe.correction: 0.147682 hartree
zpe.thermalcorrener: 0.156606 hartree
zpe.thermalcorrenthalpy: 0.157550 hartree
zpe.thermalcorrgfe: 0.112909 hartree
zpe.sumelectzpe: -489.751389 hartree
zpe.sumelectthermal: -489.742465 hartree
zpe.sumelectthermalent: -489.741521 hartree
zpe.sumelectthermalfe: -489.786162 hartree
dipole: 4.6815 -0.3641 -0.4585
dipole: 4.7179
quadrupole: -60.4237 -69.4056 -64.9056
quadrupole: 0.3868 -0.8168 -0.8004
quadrupole: 4.4879 -4.4940 0.0060 0.3868 -0.8168 -0.8004
hfenergy: -489.8990711 hartree
pointgroup: C01 [X(C7H8N4)]
dipole: -1.8329938 -0.2275335 0.1837614 debye
dipolederiv: -0.7246106 0.0270566 0.0121364 -0.2784202 -0.6035506 0.0078485 0.0982234 0.0013815 -0.1950257 -0.6661036 -0.1268096 0.0283894 0.0116633 -0.3809131 -0.0007624 0.064863 0.0255664 -0.253742 -0.5648213 -0.0074567 0.0357436 0.0891487 -0.3725724 0.019668 0.0313558 0.0173138 -0.1880382 -0.4415219 -0.0537079 0.0273752 0.1049454 -0.6194716 0.0174971 0.0271581 0.0408009 -0.2189825 0.6243613 0.1840941 -0.0011099 0.2775347 0.2765861 0.0236921 -0.077023 0.0116655 0.2701565 0.8005109 -0.2840685 -0.0271858 0.0218356 -0.0190785 -0.010646 -0.0873542 0.0527741 0.1303163 -0.249186 -0.1063334 0.0484617 -0.4976273 0.073164 0.044078 0.0879796 0.0233992 0.0712051 0.3041135 0.2107441 -0.0643633 0.4052412 0.654935 -0.0634273 -0.0961729 -0.085014 -0.0416786 -0.053481 -0.0390443 -0.0086482 -0.0660446 0.0205486 -0.0445429 -0.0029935 -0.0598245 -0.0563588 0.4608243 0.0811433 -0.0731394 -0.0251754 0.3871064 -0.0300926 -0.0691945 -0.0444889 -0.0120581 0.4078344 0.049866 -0.0623692 -0.0614602 0.5400618 -0.0451941 -0.0632552 -0.0557995 -0.048784 0.0350192 0.0219676 -0.0776689 -0.0597122 -0.0062525 0.0853506 -0.027768 0.0581207 -0.0044085 -0.0585814 0.0184395 0.0638015 0.0790409 -0.0174067 -0.1131058 0.047361 -0.060541 0.0279764 0.0003925 0.0543625 0.0231248 0.0255917 0.1055846 0.0038081 0.0262379 -0.0010774 0.165077 0.1006404 0.0225448 -0.0418141 0.0637853 -0.0471165 0.1181374 -0.0454205 0.0651024 -0.0189435 -0.1044285 -0.1326611 0.0229693 -0.1530855 0.0261107 0.016049 0.0175958 0.0190006 0.0758435 0.01992 0.1031282 0.0722214 0.0799803 0.0469472 -0.0584823 0.0446271 -0.0375566 0.0403248 0.0457939 -0.0762442 0.0172328 -0.0749498 -0.008305 0.021483 0.0180035 0.0218139 0.1234103 0.0633241 0.0529791 0.004843 0.0577083 -0.0563776 0.0086415 0.0057766 0.0073627 0.1337098 unknown
polarizability: 130.2441726|-7.7767652|105.3157976|-6.7680048|-1.262288|53.2311753 unknown
InChI: InChI=1S/C7H8N4/c1-2-11-5-10-6-3-8-4-9-7(6)11/h3-5H,2H2,1H3
charge 0 multiplicity 1
19 atoms
N  -1.293204 0.25681 0.317824
N  0.020825 2.122925 -0.034039
N  0.462039 -1.488735 0.193429
N  2.696006 -0.541754 -0.212666
C  -2.494406 -0.579028 0.517167
C  0.012502 -0.209104 0.154739
C  0.820986 0.960824 -0.059509
C  -1.220095 1.65407 0.188774
C  -3.032741 -1.159042 -0.806051
C  2.201781 0.733517 -0.243756
C  1.814201 -1.57451 0.002438
H  -2.216427 -1.396787 1.204732
H  -3.257722 0.04341 1.017111
H  -2.107956 2.279005 0.273885
H  -3.314239 -0.356971 -1.510778
H  -3.927128 -1.776407 -0.608103
H  -2.272248 -1.798579 -1.284828
H  2.915773 1.545671 -0.414451
H  2.245252 -2.579214 0.021984
