program: Gaussian 09
title: 000225351
version: EM64L-G09RevD.01
frameworkgroup: C1[X(C8H10N4S)]
method: RPBEPBE
basis: SDD
operation: Freq
keyword: #p
keyword: freq=noraman
keyword: PBEPBE/SDD
title: #p freq=noraman PBEPBE/SDD
converged: YES YES NO NO
title: Mulliken charges:
elementType: S N N N N C C C C C C C C H H H H H H H H H H
charge: 0.280357 -0.155994 -0.074095 -0.019712 0.014136 0.135472 -0.339923 0.121859 -0.231380 -0.657329 -0.356264 -0.380950 -0.834420 0.251380 0.214610 0.269796 0.221025 0.224250 0.255881 0.248976 0.283654 0.282833 0.245839
chargesum: 0.00000
title: Mulliken charges with hydrogens summed into heavy atoms:
elementType: S N N N N C C C C C C C C
charge: 0.280357 -0.155994 -0.074095 -0.019712 0.014136 0.135472 0.126067 0.121859 0.038416 0.043827 -0.356264 -0.131974 -0.022095
polarizability: 1.86043135e+02 -3.37233884e+00 1.44086615e+02 6.23024872e+00 4.89985900e-01 6.70010083e+01
1716.lowfreq: -4.8386 -0.0014 -0.0009 0.0005 2.1093 10.9762 41.7733 48.6653 68.0505
frequency: 41.5545 48.3910 67.9642 132.6142 153.0523 156.2630 194.2116 229.3970 251.9724 262.9987 292.6857 368.8935 407.2923 511.0313 537.5904 545.7208 631.0492 643.3098 650.6191 659.3675 695.6334 790.6767 793.1907 812.9367 835.5178 904.1538 923.5383 964.0585 972.8451 1001.6822 1063.5377 1092.2303 1096.9620 1151.1536 1191.7950 1211.2586 1260.5403 1287.8228 1294.3169 1344.8404 1353.2943 1358.0132 1370.6987 1391.5928 1394.7021 1438.0232 1439.6838 1445.7965 1469.3730 1475.8298 1486.3150 1507.4671 1543.8061 2994.9191 3019.1990 3030.1905 3075.0246 3094.8038 3109.6366 3151.5354 3171.4987 3172.3902 3226.6820
redmass: 2.9107 3.1211 4.1915 1.6783 2.0215 2.6529 1.9315 4.5572 1.9507 5.1648 2.8126 9.9879 4.3629 4.2537 5.0478 7.2728 7.4288 5.2036 5.7734 6.1824 5.4573 1.6054 2.6636 9.1612 1.6078 6.3739 1.4287 2.2117 1.1838 1.3657 2.2546 1.9504 5.8052 4.7296 2.8216 1.8875 1.8580 5.5514 5.7875 1.6133 1.1818 1.6670 3.7090 1.6273 1.2401 1.7466 1.0523 1.3004 1.0858 1.2842 1.0646 8.5420 7.7435 1.0357 1.0601 1.0294 1.1037 1.0999 1.1025 1.1031 1.1056 1.0924 1.0983
irintensity: 2.4851 0.4162 0.4413 0.0548 0.1866 3.2585 0.6999 1.3113 3.7986 0.3812 1.2182 3.7550 1.1015 2.4006 2.8739 6.2903 4.7184 10.7407 5.6286 2.5325 8.3192 10.2366 7.3245 37.9848 13.4134 73.9380 11.4694 0.6493 7.4959 5.8802 4.8155 7.4909 3.7287 85.1530 1.5480 81.2030 8.4232 62.4006 56.8708 39.4258 4.0003 1.5074 7.5781 60.8763 14.1693 43.5873 16.2950 5.3447 18.3058 16.6643 16.0634 260.6874 68.3263 21.5661 31.8920 18.0076 2.1952 37.0662 22.7260 11.0435 8.7852 17.5291 0.1144
temp: 298.150 k
press: 1.00000 atm
elementType: 16 7 7 7 7 6 6 6 6 6 6 6 6 1 1 1 1 1 1 1 1 1 1
symmnumber: 1
zpe: 461729.5 jmol-1
zpe.correction: 0.175863 hartree
zpe.thermalcorrener: 0.188298 hartree
zpe.thermalcorrenthalpy: 0.189242 hartree
zpe.thermalcorrgfe: 0.135945 hartree
zpe.sumelectzpe: -926.961853 hartree
zpe.sumelectthermal: -926.949418 hartree
zpe.sumelectthermalent: -926.948474 hartree
zpe.sumelectthermalfe: -927.001772 hartree
dipole: -4.1004 -3.3186 -0.1761
dipole: 5.2780
quadrupole: -73.7417 -84.3054 -84.9121
quadrupole: -1.3779 0.7368 0.3587
quadrupole: 7.2447 -3.3190 -3.9257 -1.3779 0.7368 0.3587
hfenergy: -927.1377166 hartree
pointgroup: C01 [X(C8H10N4S1)]
dipole: -1.6197016 1.2599464 -0.3178528 debye
dipolederiv: -0.6767007 -0.3445592 0.158358 -0.2092122 0.0218889 -0.0074705 0.1247478 0.0076937 -0.0793049 -0.8440982 0.1082524 -0.0553022 -0.1746412 -0.4270547 0.0606749 0.1042607 0.0367701 -0.1952839 -0.6272433 0.0090799 -0.005441 0.0785277 -0.3657524 0.0465673 0.0197401 0.0381785 -0.2335532 -0.7295222 0.0039072 0.0392481 0.1049426 -0.5461496 0.1228237 0.0021012 0.1178246 -0.2345158 -0.8446946 -0.2079777 0.1161956 -0.5669765 -0.7620536 0.2324786 0.2428207 0.196796 -0.2644824 0.6603225 -0.3398943 0.0839324 -0.1299915 0.3720513 -0.1019181 -0.0030694 -0.0492959 0.1407194 0.8013653 -0.0280844 0.0443271 0.0334446 0.1981596 0.0425504 -0.0480479 0.0595247 0.2396672 -0.8172276 -0.0327355 0.0761068 -0.1391479 0.1084457 -0.015743 0.1355686 -0.0011899 0.068555 0.5496407 0.1528919 -0.0796885 0.4807487 0.2678612 -0.1068399 -0.2177093 -0.1100915 -0.0287766 -0.0876318 0.0040139 -0.0313276 -0.0220613 0.0072389 -0.0600666 -0.0238163 -0.073213 -0.0256376 1.5747191 0.4122074 -0.2676098 0.4817664 0.436446 -0.1741842 -0.3044894 -0.1696869 0.0946039 0.8339258 0.0583824 -0.0962336 0.0579574 0.5409537 -0.1984794 -0.1074459 -0.189186 0.0106159 0.0102295 0.0866757 -0.0244951 0.0494647 0.1245207 -0.0327127 -0.0123012 -0.0372795 0.0466265 0.013848 0.0005846 -0.029856 -0.0816907 0.0637074 0.083826 0.0244743 0.0398007 -0.0537382 -0.0196383 0.0156092 -0.0014672 0.0913164 -0.1150841 -0.0787474 -0.0175703 -0.0287401 0.0780231 0.0445399 0.0727256 -0.0059844 0.0511352 0.0537109 0.0309106 0.0014682 0.0279617 0.1615356 0.1076216 -0.0484051 0.0419138 -0.0181831 0.010066 0.1137104 0.0031645 0.0659677 -0.0806433 -0.2087442 -0.0206477 0.0168558 -0.0389257 0.1130026 -0.0093478 0.0160635 -0.0043598 0.0793234 0.1084351 0.0893406 0.0149701 0.0653094 -0.0581272 -0.0460519 0.0173393 -0.0111239 0.0754534 0.0765095 -0.0229916 0.0119271 -0.026943 -0.0631146 0.063866 0.0136638 0.0609114 0.1105446 0.1122146 0.0703998 0.0528479 0.0007724 -0.043059 -0.038164 0.0631853 -0.0304815 -0.0048293 0.0827139 0.0291793 -0.1031669 -0.0325162 0.0003362 0.045992 -0.0755537 0.025364 -0.0233399 -0.1205846 -0.0679547 0.0438896 -0.0550961 0.0620061 0.0263255 0.0414055 0.0278546 0.1184373 unknown
polarizability: 185.9653858|1.440172|137.448379|-7.3916815|-21.6817246|73.7169927 unknown
InChI: InChI=1S/C8H10N4S/c1-3-12-5-11-6-7(12)9-4-10-8(6)13-2/h4-5H,3H2,1-2H3
charge 0 multiplicity 1
23 atoms
S  3.521298 -0.416243 -0.330973
N  -1.566055 0.444029 -0.065072
N  0.472545 1.383601 -0.566367
N  -0.840105 -1.835762 0.545059
N  1.58794 -2.108222 0.380608
C  -0.616047 -0.559785 0.133243
C  -3.026326 0.287481 0.090094
C  0.654583 0.037087 -0.17898
C  -0.855816 1.575408 -0.486663
C  -3.675952 -0.393582 -1.131276
C  1.781867 -0.818743 -0.032954
C  0.322232 -2.548479 0.645442
C  3.502592 1.389734 -0.877542
H  -3.197818 -0.317922 0.99715
H  -3.454917 1.291244 0.260722
H  -1.357546 2.513897 -0.715434
H  -3.51199 0.193253 -2.052021
H  -4.764542 -0.49066 -0.970731
H  -3.257008 -1.403454 -1.275875
H  0.233003 -3.587974 0.972772
H  3.080677 2.02539 -0.088939
H  2.915775 1.506914 -1.797322
H  4.562611 1.631787 -1.053538
