program: Gaussian 09
title: 000225339
version: EM64L-G09RevD.01
frameworkgroup: C1[X(C7H12ClNO3S2)]
method: RPBEPBE
basis: SDD
operation: Freq
keyword: #p
keyword: freq=noraman
keyword: PBEPBE/SDD
title: #p freq=noraman PBEPBE/SDD
converged: YES YES NO NO
title: Mulliken charges:
elementType: Cl S S O O O N C C C C C C C H H H H H H H H H H H H
charge: -0.041601 0.151326 0.074049 -0.197990 -0.207789 -0.181373 -0.030778 -0.297720 -0.585270 -0.587586 -0.251209 -0.544600 -0.326457 0.029860 0.257413 0.261983 0.231214 0.228712 0.251268 0.252053 0.228842 0.230825 0.232636 0.267789 0.257621 0.296781
chargesum: 0.00000
title: Mulliken charges with hydrogens summed into heavy atoms:
elementType: Cl S S O O O N C C C C C C C
charge: -0.041601 0.151326 0.074049 -0.197990 -0.207789 -0.181373 -0.030778 0.221677 0.125924 0.124135 0.249216 0.009801 -0.326457 0.029860
polarizability: 2.08746814e+02 -3.73652983e+00 1.35842682e+02 2.78793249e-01 -6.19644439e+00 1.05634339e+02
1716.lowfreq: -9.1015 -0.0033 -0.0031 -0.0027 2.1935 7.0701 14.8725 24.7334 27.2704
frequency: 14.2945 24.7025 27.2283 39.8983 44.9111 57.7377 76.9441 91.1164 131.5277 148.0243 154.6275 161.9485 184.6541 198.9790 241.8461 260.0421 305.1832 334.5179 378.6854 385.5980 446.7397 448.0446 461.9740 500.0726 513.5629 575.7082 600.1161 610.5939 740.0925 799.3180 833.6739 875.7454 939.7279 945.2685 977.9802 1050.7796 1056.2029 1072.7441 1074.8087 1105.9594 1115.1091 1144.6747 1174.2512 1179.6891 1233.0511 1290.0530 1305.3769 1310.1622 1351.2560 1403.2391 1422.1865 1428.3971 1433.9961 1444.6239 1458.4527 1471.1946 1479.3539 1480.6734 1529.7393 1640.1449 2971.5355 2975.3813 3023.7769 3055.5812 3061.7418 3063.0669 3076.7219 3099.3973 3102.3320 3106.3410 3142.7764 3185.3039
redmass: 6.1289 5.3181 5.0829 6.9102 8.9040 8.2751 4.9779 3.4316 3.6071 3.9779 2.0059 1.6034 1.5936 5.2935 4.7035 7.3984 2.6172 7.3932 4.6734 3.4245 8.1037 3.5733 1.9566 5.4889 10.2863 14.4973 10.1341 5.3878 5.9653 3.5385 3.9786 5.7787 1.8002 1.7217 1.9658 1.7003 4.2650 1.2660 3.1509 1.6553 1.2199 1.4380 1.4136 1.2166 1.1303 3.1826 1.1904 2.4667 1.2894 1.7006 1.0969 1.1393 1.1866 1.0900 1.0414 1.0434 1.0615 1.1379 1.7049 10.9525 1.0365 1.0373 1.0571 1.0585 1.0982 1.0982 1.0574 1.1071 1.1010 1.1011 1.1098 1.1185
irintensity: 1.8395 0.6075 0.5919 0.3175 0.0966 0.3576 3.6130 22.3470 17.6751 7.6939 6.4077 2.4139 37.7132 12.2087 222.4656 67.3417 26.0967 17.5219 47.1832 14.7996 21.5523 16.8735 1.0860 114.9966 7.2457 144.9183 5.4340 23.9621 68.1153 99.0319 12.5237 407.9687 10.9122 61.8926 9.9296 12.0898 195.2337 3.9856 128.8259 433.1240 6.3301 22.2762 245.4694 1.0071 4.8483 363.2902 18.7311 4.0568 7.8844 65.6824 22.7955 8.4619 1.5152 31.7862 4.9332 43.7541 13.6795 4.5180 111.4750 309.2076 38.6604 65.5396 24.2887 27.2618 46.1010 15.0865 8.7091 3.9759 9.6332 34.3207 4.2382 6.3538
temp: 298.150 k
press: 1.00000 atm
elementType: 17 16 16 8 8 8 7 6 6 6 6 6 6 6 1 1 1 1 1 1 1 1 1 1 1 1
symmnumber: 1
zpe: 496756.3 jmol-1
zpe.correction: 0.189204 hartree
zpe.thermalcorrener: 0.207408 hartree
zpe.thermalcorrenthalpy: 0.208353 hartree
zpe.thermalcorrgfe: 0.137880 hartree
zpe.sumelectzpe: -1809.394343 hartree
zpe.sumelectthermal: -1809.376139 hartree
zpe.sumelectthermalent: -1809.375195 hartree
zpe.sumelectthermalfe: -1809.445668 hartree
dipole: -6.1214 0.3667 4.7081
dipole: 7.7313
quadrupole: -73.9497 -115.4705 -97.9472
quadrupole: -5.7506 12.0879 -0.5717
quadrupole: 21.8395 -19.6814 -2.1581 -5.7506 12.0879 -0.5717
hfenergy: -1809.5835473 hartree
pointgroup: C01 [X(C7H12Cl1N1O3S2)]
dipole: -2.5466895 0.0299669 -1.6629759 debye
dipolederiv: -0.2872635 -0.0203291 -0.1533609 0.0128384 -0.1757572 0.0700673 -0.1611721 0.0007801 -0.3869573 -1.0300304 0.2633685 0.3570124 0.4203408 -0.5267736 -0.22343 0.3846238 -0.1472586 -0.194475 -0.5951258 -0.265116 -0.1148697 -0.2614491 -0.8634872 -0.2756996 -0.0315537 -0.1937242 -0.1899835 -2.7369682 -0.5683828 -0.1792633 -0.7526684 -0.632979 -0.2057495 -0.3155232 -0.1201696 -0.2881898 -0.7874648 -0.1782544 0.2284927 -0.6519416 -0.9556278 0.4653537 0.5168898 0.4325986 -0.5781325 -1.120091 0.4770044 0.2218853 0.2389653 -0.7116051 0.0467014 0.2867103 -0.0255759 -0.3828382 -1.6127614 -0.2795552 -0.1537342 0.0059112 -0.4527978 -0.011027 -0.2145957 -0.0668724 -0.4370719 2.3388958 0.4555031 0.3080916 0.9556754 0.5447067 0.1579639 0.7942924 0.1805558 0.3189456 0.4435955 0.0887296 -0.1442947 0.2001884 0.2308492 0.0803955 -0.3134894 0.0156416 0.2683229 0.250885 -0.0310128 0.1485065 -0.0958317 0.2967828 -0.0778061 0.3937475 -0.0088003 0.2843728 0.6220659 0.3268672 -0.1774668 0.3055381 0.348219 -0.036524 -0.2281843 -0.1638873 0.243002 0.2464754 -0.0434339 0.2523478 -0.1237932 0.0880167 -0.1275079 0.271116 -0.0955811 0.4700384 2.38209 0.3847744 0.100945 -0.5390793 1.4137134 0.6381501 -0.3265875 0.3796347 0.045097 1.9307742 -0.5666325 -0.6441158 0.3778113 1.2041701 -0.5637861 -0.8837395 -0.309777 0.7241506 0.034679 0.0018588 -0.0363782 -0.0917393 -0.0295852 0.0288501 -0.1305686 0.0563796 0.0126431 0.0220197 -0.0153663 0.0449378 -0.1629371 0.0278537 -0.0122133 0.0293317 -0.0318598 -0.0392076 0.0932842 0.1022518 -0.0522133 0.0384016 -0.017427 0.1076374 0.0053109 0.0820657 0.0015004 -0.18914 -0.0664162 -0.0121174 -0.0432501 0.1032415 -0.0239022 -0.0865864 -0.0337417 0.0506685 0.032444 -0.0431105 0.0234996 0.0494263 -0.076864 -0.1328779 0.1404823 -0.0312604 0.0155522 0.0919611 -0.0067978 -0.0353194 0.1090049 -0.1116773 0.0203009 -0.0611873 -0.0970056 0.0229985 -0.1754374 -0.0334508 -0.1073172 -0.059631 0.0662705 0.0048718 -0.0594636 0.0143102 0.0863115 0.0449326 0.0329741 0.1449324 0.0361883 0.0715394 -0.0182544 0.0753557 0.0130714 -0.0471685 0.0053041 -0.0348941 -0.0747402 -0.0871991 0.0342005 0.056373 -0.0108792 0.0766621 -0.0844231 -0.0179895 -0.0183316 0.0560334 0.0850625 0.018047 -0.0554426 0.0082875 0.0205374 0.1091039 -0.0405304 -0.093758 0.0226161 -0.0771997 0.0192812 0.0864865 -0.0004164 0.0866196 -0.0248063 0.053396 0.1315103 -0.0241095 0.111367 0.0876893 0.0010691 -0.0822007 -0.033343 0.0005464 unknown
polarizability: 203.9903674|18.1963573|140.5908892|-4.6267719|4.9345409|105.6425783 unknown
InChI: InChI=1S/C7H12ClNO3S2/c1-9(2)5-12-7(13)14-6(10)11-4-3-8/h3-5H2,1-2H3
charge 0 multiplicity 1
26 atoms
Cl 4.898837 0.775695 1.00393
S  0.73871 -1.887634 0.524585
S  0.496332 1.21034 1.327527
O  -1.53504 -0.492984 0.992047
O  2.272365 -0.208711 -0.904013
O  3.267776 -2.269985 -0.382329
N  -3.670706 -1.508859 0.119973
C  -2.348253 -1.843154 0.234007
C  -4.540363 -1.563274 1.311814
C  -4.089651 -0.562949 -0.933349
C  3.541054 0.367465 -1.436755
C  4.027726 1.473293 -0.511417
C  -0.22124 -0.255041 0.935044
C  2.330541 -1.457941 -0.318252
H  -2.127609 -2.634729 0.960781
H  -1.788675 -1.912828 -0.707827
H  -4.194227 -2.359893 1.99055
H  -5.577206 -1.787585 1.005255
H  -4.528993 -0.603401 1.864714
H  -4.023688 0.486077 -0.583605
H  -5.131012 -0.776992 -1.231432
H  -3.44071 -0.676996 -1.817111
H  3.255919 0.796294 -2.413718
H  4.288081 -0.433608 -1.572676
H  4.769024 2.109988 -1.019268
H  3.185406 2.067111 -0.127575
