program: Gaussian 09
title: 000225333
version: EM64L-G09RevD.01
frameworkgroup: C1[X(C9H8Cl2N2O4)]
method: RPBEPBE
basis: SDD
operation: Freq
keyword: #p
keyword: freq=noraman
keyword: PBEPBE/SDD
title: #p freq=noraman PBEPBE/SDD
converged: YES YES NO NO
title: Mulliken charges:
elementType: Cl Cl O O O O N N C C C C C C C C C H H H H H H H H
charge: 0.009665 -0.017117 -0.311928 -0.248782 -0.188200 -0.194028 -0.123962 0.028687 0.419706 0.361562 -0.263881 -0.346034 -0.224785 -0.089089 0.305466 -0.602536 -0.608401 0.312101 0.289791 0.230572 0.276983 0.237949 0.225432 0.238866 0.281963
chargesum: 0.00000
title: Mulliken charges with hydrogens summed into heavy atoms:
elementType: Cl Cl O O O O N N C C C C C C C C C
charge: 0.009665 -0.017117 -0.311928 -0.248782 -0.188200 -0.194028 -0.123962 0.028687 0.419706 0.361562 -0.263881 -0.033933 0.065006 -0.089089 0.305466 0.142968 0.137861
polarizability: 2.25617591e+02 -8.87798585e+00 1.60568141e+02 1.26050987e+01 -3.01751903e+00 8.01202272e+01
1716.lowfreq: -7.8030 -4.1968 -0.6613 0.0014 0.0017 0.0019 32.3252 33.7848 44.7324
frequency: 32.2676 33.7429 44.7104 57.2359 76.1696 102.3927 119.3344 138.2874 144.8710 164.7945 168.9711 191.2639 221.6145 254.7871 295.3458 324.0585 337.4744 354.6125 376.2685 403.8224 413.3912 470.7433 482.2399 532.2600 577.1449 614.4224 654.2984 673.0426 685.5196 708.0982 743.4574 765.4088 818.5274 857.7882 873.5806 909.7317 950.1973 1060.5267 1071.2304 1096.0270 1098.3160 1124.3156 1150.3612 1184.9678 1198.9352 1225.6673 1250.7716 1352.9902 1366.8840 1370.3087 1391.6236 1427.9262 1437.5946 1447.2530 1468.6882 1475.0880 1484.7263 1498.1711 1557.2536 1589.5738 1720.7650 2979.8198 2984.2221 3056.8877 3061.3786 3131.1047 3156.8191 3185.4395 3190.8646
redmass: 4.5330 5.2419 5.9033 2.0283 2.1781 4.8517 1.1177 8.0846 7.4277 11.3433 19.1153 5.0499 7.6101 3.3502 6.1949 8.2492 18.8520 5.5048 7.7515 4.0455 8.3024 5.4028 6.1380 5.8434 4.6740 6.4662 11.1583 8.5607 11.0745 7.6706 10.3301 9.7429 9.3784 8.2130 1.4285 1.3995 4.7444 1.4110 2.4448 1.9187 1.3007 3.9142 1.3761 1.5908 8.2882 4.7627 4.9257 4.5143 3.1309 11.2713 5.2714 1.1505 1.3081 3.0054 1.0450 1.0436 1.0475 1.1773 9.3658 8.5784 9.4970 1.0370 1.0372 1.1013 1.1022 1.0985 1.0961 1.0937 1.0929
irintensity: 4.8224 0.3287 1.4023 0.3662 0.1528 0.3094 0.1699 0.9125 3.7782 0.7875 0.7175 0.9707 0.2600 5.0457 1.2290 13.9332 0.2681 17.1908 0.1187 3.2052 2.8128 2.4107 12.2079 5.8913 5.6848 3.3061 13.5064 10.6350 20.7449 21.5167 100.0794 51.2188 9.9269 10.3159 25.2196 12.2302 114.0011 41.4802 97.8840 428.9432 71.0586 20.2524 0.9362 2.4595 220.6155 177.9479 9.8357 7.6659 122.9744 96.2964 8.4166 31.4766 59.4623 219.4136 16.5036 4.3824 35.6484 13.1401 6.8193 10.6458 378.3820 22.1124 105.5647 38.1340 17.3808 2.1082 4.1561 2.3193 11.6782
temp: 298.150 k
press: 1.00000 atm
elementType: 17 17 8 8 8 8 7 7 6 6 6 6 6 6 6 6 6 1 1 1 1 1 1 1 1
symmnumber: 1
zpe: 432859.0 jmol-1
zpe.correction: 0.164867 hartree
zpe.thermalcorrener: 0.182199 hartree
zpe.thermalcorrenthalpy: 0.183143 hartree
zpe.thermalcorrgfe: 0.117339 hartree
zpe.sumelectzpe: -1676.931004 hartree
zpe.sumelectthermal: -1676.913673 hartree
zpe.sumelectthermalent: -1676.912729 hartree
zpe.sumelectthermalfe: -1676.978533 hartree
dipole: -2.1303 3.1278 -1.4952
dipole: 4.0690
quadrupole: -88.8008 -120.5569 -114.8451
quadrupole: -2.2153 1.1861 -0.2233
quadrupole: 19.2668 -12.4893 -6.7775 -2.2153 1.1861 -0.2233
hfenergy: -1677.0958716 hartree
pointgroup: C01 [X(C9H8Cl2N2O4)]
dipole: 0.9108925 0.9761881 0.8832556 debye
dipolederiv: -0.1563955 -0.2205117 -0.0617045 -0.1991303 -0.5731053 -0.1479918 -0.0501914 -0.1468477 -0.0625538 -0.8538106 -0.0044868 -0.0707891 -0.0288637 -0.0968627 -0.0160694 -0.0880627 -0.0130964 -0.0528285 -2.1390425 0.003683 0.3587708 0.3554723 -0.2365855 -0.1259292 0.4550397 -0.1228153 -0.5253673 -0.8403875 0.0214895 -0.1958334 0.0067615 -0.3041596 -0.114618 -0.0671185 -0.0305355 -0.9950601 -0.4739237 -0.0611055 -0.1135796 -0.1345823 -0.799818 -0.205164 -0.1580183 -0.1809606 -0.3108037 -0.6967293 0.1304529 -0.1861818 0.1234942 -0.4851491 -0.0125901 -0.1217617 -0.0286012 -0.3071877 -1.3424528 0.0422766 -0.2045378 -0.0778484 -0.3175203 -0.0622153 -0.1050032 -0.0009629 -0.5466382 1.0331327 -0.3502937 0.3046486 -0.1548262 1.5037445 0.2999323 0.2954489 0.2885793 0.4164599 1.3882343 0.0406406 -0.1341094 -0.1028408 0.0105544 -0.1101613 0.1672731 0.0123113 0.0348512 -0.0394515 0.4205389 0.0380713 0.1623779 -0.4311375 -0.0723196 -0.1045911 -0.043725 0.044294 -0.1152716 0.3708592 0.1436594 0.427404 0.9183051 0.2681178 0.1750311 0.2760668 0.000576 -0.3758152 -0.2764675 -0.0587777 0.0812108 -0.0306131 0.0192556 0.0129437 -0.0554731 -0.0603855 -0.2283723 -0.0713754 -0.0547823 -0.0512122 -0.1024214 -0.0419257 -0.0319252 -0.0273626 -0.0452196 1.3562974 0.0468545 0.143273 -0.0448113 -0.0843737 0.0319114 0.1530649 0.0068806 -0.045602 2.6513226 -0.0905435 0.1471563 -0.4415983 0.3318669 0.2591977 -0.407235 0.0726597 1.4051147 0.4499745 -0.0396952 -0.1489767 -0.0647892 0.2509504 -0.007932 -0.4094208 -0.0095008 0.081337 0.1474773 0.0605569 0.17322 0.1384195 0.2415903 -0.0054862 0.3237897 -0.0333292 0.3749779 0.130845 0.0008216 0.004082 -0.0315382 0.1148021 -0.0170294 -0.0354676 -0.0108552 0.1715297 0.0882071 0.033206 0.0042245 0.0346733 0.0679959 -0.0203301 -0.0095292 -0.0258825 0.1581607 -0.1113162 -0.0782332 0.0495339 -0.148912 -0.043159 0.005237 0.0269657 -0.0360571 0.1067673 0.1398656 -0.0113865 -0.0922827 0.0094634 0.1224448 -0.0188344 -0.0018375 -0.0243147 -0.0117934 -0.0390694 0.066536 0.0216469 0.1550179 -0.0657244 0.0474926 0.0030392 0.1007032 0.0698229 -0.084618 -0.1265274 -0.0741913 -0.1653631 -0.0099749 -0.0259012 -0.0206398 0.0322158 0.0442416 0.0377817 0.0423533 -0.0849781 0.106 -0.0816808 0.1072179 -0.0959195 0.0194075 0.0053292 0.073518 0.0503575 0.0924376 0.0460213 0.100031 -0.0338644 0.0941256 -0.0185042 0.0499778 unknown
polarizability: 226.4332188|1.2271432|152.841093|13.7199253|22.4934071|87.0316472 unknown
InChI: InChI=1S/C9H8Cl2N2O4/c1-12(2)9(14)17-8-6(11)3-5(10)4-7(8)13(15)16/h3-4H,1-2H3
charge 0 multiplicity 1
25 atoms
Cl -0.386252 3.230713 0.917952
Cl -4.911969 0.254968 -0.236118
O  1.059694 0.692354 0.491301
O  1.543065 0.034182 -1.733631
O  -0.774832 -2.973262 -0.753859
O  0.991026 -2.062965 0.356047
N  3.248324 0.2474 -0.119798
N  -0.185842 -1.987767 -0.168743
C  -0.302358 0.518053 0.295722
C  -0.937562 -0.711972 -0.046417
C  -1.140972 1.64697 0.488847
C  -2.336617 -0.798069 -0.226152
C  -2.537061 1.580849 0.345195
C  -3.11416 0.348658 -0.024537
C  1.965637 0.266025 -0.580184
C  4.322124 -0.116461 -1.062752
C  3.636844 0.449117 1.286653
H  -2.775004 -1.75803 -0.507932
H  -3.152534 2.469893 0.501848
H  5.082302 0.685476 -1.100285
H  3.891605 -0.258898 -2.064564
H  4.808037 -1.056861 -0.74199
H  4.446333 1.200072 1.343142
H  4.002037 -0.501205 1.720508
H  2.777237 0.799861 1.870246
