program: Gaussian 09
title: 000225328
version: EM64L-G09RevD.01
frameworkgroup: C1[X(C21H14O)]
method: RPBEPBE
basis: SDD
operation: Freq
keyword: #pfreq=noraman
keyword: PBEPBE/SDD
title: #p freq=noraman PBEPBE/SDD
converged: YES YES NO NO
title: Mulliken charges:
elementType: O C C C C C C C C C C C C C C C C C C C C C H H H H H H H H H H H H H H
charge: -0.199982 0.283360 0.237110 0.223485 0.197665 0.201961 -0.341614 -0.403823 -0.373009 -0.378383 -0.389998 -0.415663 0.359047 -0.248993 -0.243081 -0.241639 -0.238983 -0.402828 -0.358623 -0.238469 -0.232400 -0.242369 0.218989 0.230535 0.281461 0.290646 0.291106 0.230669 0.233952 0.237817 0.237358 0.233999 0.266629 0.229467 0.232102 0.232498
chargesum: 0.00000
title: Mulliken charges with hydrogens summed into heavy atoms:
elementType: O C C C C C C C C C C C C C C C C C C C C C
charge: -0.199982 0.283360 0.237110 0.223485 0.197665 0.201961 -0.341614 -0.184834 -0.142473 -0.096921 -0.099352 -0.124557 0.359047 -0.018324 -0.009129 -0.003822 -0.001625 -0.168829 -0.091994 -0.009003 -0.000299 -0.009871
polarizability: 3.78140708e+02 -3.03891267e+00 2.75315585e+02 -1.64273277e+01 1.90212118e+01 1.17752364e+02
1716.lowfreq: -7.6069 -3.0413 0.0002 0.0004 0.0006 1.5883 34.1716 39.1743 57.7967
frequency: 34.1622 39.1580 57.7894 74.1500 112.1129 145.8326 153.4151 186.0077 212.3044 241.2682 273.7489 296.5032 331.4149 361.7733 402.9720 406.7589 415.2003 426.9631 453.1122 483.6839 516.3401 531.8862 558.6572 600.4780 616.8657 627.8138 629.6590 662.1100 680.6439 691.5872 698.0785 736.0810 755.2352 770.7103 776.2006 786.6642 829.6467 834.7441 851.4403 875.1192 887.9153 903.4999 917.5393 918.8042 943.0405 974.1909 979.8394 982.2979 987.3096 997.7365 1002.5935 1004.9520 1026.7186 1036.6634 1045.3148 1078.7100 1088.4026 1093.9733 1154.4481 1173.2903 1173.6031 1174.7132 1179.6269 1192.8847 1220.2912 1246.0204 1270.5087 1278.2081 1307.6793 1327.9259 1364.4745 1377.0946 1386.9307 1396.1918 1433.4643 1436.0021 1451.1354 1466.3918 1472.6437 1483.4742 1540.1889 1562.2771 1573.9529 1582.7524 1596.0121 1605.4525 1606.8358 1619.7385 3101.1018 3120.0379 3129.2543 3130.9066 3132.6409 3143.4651 3143.9642 3148.2759 3154.0990 3158.7796 3162.6600 3168.3176 3170.2784 3173.2387
redmass: 4.2845 6.1543 4.8347 4.7632 4.1035 5.4090 4.5945 5.0244 5.1979 4.8181 5.2896 3.9804 6.6821 5.4061 2.8811 5.1957 4.7833 4.4197 3.3774 3.3386 4.1203 5.3811 6.8071 5.0377 6.2072 6.4999 4.1454 6.2096 3.4682 4.6891 1.8074 3.5447 2.1563 1.2973 2.1210 2.6440 2.7355 4.3284 1.2603 1.5855 1.5003 1.6474 2.3722 4.2833 2.3881 1.3926 1.3864 1.3942 6.1825 1.3187 1.3455 1.3494 2.2234 2.4201 1.9102 2.3815 2.0969 2.1792 1.9694 1.1346 1.6261 1.2147 1.1351 1.1190 1.6433 2.5764 2.2472 1.5283 2.3425 1.5025 2.6519 9.9356 6.3625 2.8493 2.3680 2.2648 2.7708 2.4504 2.4853 2.3687 9.3336 6.4330 6.1316 6.4007 6.9311 6.0937 6.1261 7.0239 1.0860 1.0870 1.0853 1.0869 1.0860 1.0892 1.0926 1.0903 1.0943 1.0961 1.0957 1.1004 1.1001 1.0984
irintensity: 0.2940 1.7190 1.1203 1.9452 0.0746 0.3017 0.5975 0.5806 0.6786 0.3066 0.9062 6.3389 8.0593 1.5599 0.6588 0.4657 1.9927 1.4921 0.6697 6.4004 9.2792 11.5920 3.9753 4.6361 0.8003 7.1268 3.9616 1.2929 32.1998 7.4350 56.7602 3.7511 24.3123 18.6209 41.6066 76.4905 4.3260 6.5533 0.2435 21.4292 0.3204 1.3173 9.9490 17.0064 12.2314 1.4751 1.5282 4.7202 0.8420 0.4465 0.6273 1.1977 5.6951 3.5203 8.7881 1.9742 11.8364 6.1541 2.3350 3.1458 11.7082 6.6692 1.7692 3.6688 2.2759 0.6362 54.8126 1.4454 127.6867 3.0737 21.3790 5.0499 44.5164 14.4559 2.2449 11.1004 5.9526 6.1953 7.1961 27.3397 177.7004 0.8030 4.8531 62.2022 40.2298 23.6870 10.7983 4.0831 7.3732 6.9524 1.6898 0.1884 2.7297 9.4511 20.4242 8.2764 8.2797 40.5060 15.7814 35.2955 15.0495 15.7887
temp: 298.150 k
press: 1.00000 atm
elementType: 8 6 6 6 6 6 6 6 6 6 6 6 6 6 6 6 6 6 6 6 6 6 1 1 1 1 1 1 1 1 1 1 1 1 1 1
symmnumber: 1
zpe: 733903.2 jmol-1
zpe.correction: 0.279529 hartree
zpe.thermalcorrener: 0.295979 hartree
zpe.thermalcorrenthalpy: 0.296923 hartree
zpe.thermalcorrgfe: 0.234720 hartree
zpe.sumelectzpe: -882.402532 hartree
zpe.sumelectthermal: -882.386083 hartree
zpe.sumelectthermalent: -882.385138 hartree
zpe.sumelectthermalfe: -882.447341 hartree
dipole: 3.7107 -2.0077 -1.7563
dipole: 4.5700
quadrupole: -119.3951 -110.4974 -132.0845
quadrupole: 10.6278 3.1066 1.5100
quadrupole: 1.2639 10.1616 -11.4255 10.6278 3.1066 1.5100
hfenergy: -882.6820612 hartree
pointgroup: C01 [X(C21H14O1)]
dipole: 1.3420668 -0.8987108 -0.7898559 debye
polarizability: 375.4668448|-14.0926169|272.4374801|-17.5440439|35.5119823|123.304332 unknown
InChI: InChI=1S/C21H14O/c22-21-18-12-6-4-10-16(18)20(14-15-8-2-1-3-9-15)17-11-5-7-13-19(17)21/h1-14H
charge 0 multiplicity 1
36 atoms
O  -3.177499 2.016851 1.366074
C  -0.210805 -0.445102 -0.305229
C  -1.626679 -0.919387 -0.278305
C  -0.014683 1.029092 -0.28684
C  -2.638604 -0.081352 0.287706
C  -1.025974 1.873661 0.268894
C  -2.332918 1.313639 0.719694
C  0.805175 -1.385377 -0.290301
C  -2.017631 -2.205577 -0.748333
C  1.131938 1.649784 -0.858327
C  -3.972463 -0.5491 0.423328
C  -0.838453 3.27948 0.332731
C  2.257918 -1.268033 -0.047867
C  -3.346885 -2.652677 -0.631932
C  1.298359 3.046577 -0.816487
C  -4.332051 -1.829292 -0.02786
C  0.322154 3.869013 -0.195845
C  3.124395 -2.22572 -0.652454
C  2.830939 -0.322745 0.854013
C  4.514137 -2.20931 -0.411291
C  4.216776 -0.318036 1.108413
C  5.068638 -1.252098 0.469804
H  0.487978 -2.431712 -0.397214
H  -1.285555 -2.855363 -1.238672
H  1.889844 1.032808 -1.347685
H  -4.70222 0.126526 0.8810
H  -1.635161 3.878953 0.784786
H  -3.62115 -3.640654 -1.018294
H  2.185919 3.498907 -1.272637
H  -5.363472 -2.183747 0.069407
H  0.461484 4.954479 -0.153927
H  2.699244 -2.980008 -1.326373
H  2.183522 0.392528 1.3698
H  5.160789 -2.946385 -0.900072
H  4.633757 0.40863 1.814587
H  6.145938 -1.242856 0.66881
