program: Gaussian 09
title: 000225321
version: EM64L-G09RevD.01
frameworkgroup: C1[X(C12H28N4)]
method: RPBEPBE
basis: SDD
operation: Freq
keyword: #pfreq=noraman
keyword: PBEPBE/SDD
title: #p freq=noraman PBEPBE/SDD
converged: NO YES NO NO
title: Mulliken charges:
elementType: N N N N C C C C C C C C C C C C H H H H H H H H H H H H H H H H H H H H H H H H H H H H
charge: -0.094784 -0.125692 -0.547262 -0.573648 -0.062939 0.030856 -0.413212 -0.393160 -0.341856 -0.335360 -0.740859 -0.768136 -0.422057 -0.417947 -0.386429 -0.372691 0.202410 0.188672 0.181954 0.197096 0.205222 0.196558 0.183038 0.197639 0.181150 0.211228 0.239112 0.215344 0.213304 0.214173 0.226421 0.220384 0.191885 0.198430 0.190380 0.226107 0.234402 0.198886 0.239427 0.171840 0.256366 0.259910 0.269792 0.254045
chargesum: 0.00000
title: Mulliken charges with hydrogens summed into heavy atoms:
elementType: N N N N C C C C C C C C C C C C
charge: -0.094784 -0.125692 -0.030986 -0.049811 0.139471 0.219529 -0.034163 0.008620 0.038821 0.057018 -0.073098 -0.107158 -0.031743 -0.001459 0.046859 0.038575
polarizability: 1.84168810e+02 -8.35660330e-01 1.53250033e+02 -4.42767097e+00 -3.66499285e-01 1.37200907e+02
1716.lowfreq: -23.9932 -0.0008 -0.0007 -0.0006 3.8759 15.5621 20.7252 30.6859 41.8090
frequency: 19.6621 30.2716 41.6813 56.6241 72.7992 82.7582 99.2269 135.8412 160.5189 181.9746 191.3264 199.3858 228.3216 247.4206 259.1203 266.3794 278.1124 288.4543 297.0343 306.8437 313.4467 368.9068 395.6933 421.7493 461.6817 480.2904 501.8411 552.4985 560.7006 605.3931 613.8046 647.5056 705.9839 755.8907 769.0785 796.7133 846.9428 854.2462 863.0005 893.1428 915.6605 918.9637 946.9360 951.0006 967.7840 1012.6985 1021.7541 1036.9204 1064.4504 1070.4598 1079.8048 1086.8001 1091.7777 1099.1627 1108.9404 1120.6255 1130.7318 1143.9278 1154.2247 1162.4895 1192.5961 1208.6741 1223.2354 1238.3237 1260.0302 1269.1408 1273.9492 1278.3875 1288.7944 1298.3459 1312.1450 1317.5591 1324.5461 1329.4765 1336.6282 1339.9478 1355.7109 1357.2700 1365.1634 1370.2916 1377.1067 1383.8401 1390.3520 1392.3038 1453.4756 1458.3449 1460.5443 1462.2544 1467.6800 1473.9397 1474.6681 1478.8996 1487.0658 1487.2061 1489.7982 1493.8091 1638.1914 1642.8343 2829.5018 2837.5683 2844.1225 2857.7358 2864.4747 2866.9627 2967.6658 2976.4126 2981.3706 2983.2169 2986.6075 2989.8513 2991.9007 3013.6155 3018.3817 3032.6962 3047.3750 3050.3780 3061.4147 3062.2459 3070.3348 3076.1753 3087.8196 3091.0202 3445.1880 3448.8427 3570.9556 3575.7777
redmass: 4.0374 3.9500 3.1192 3.7074 1.8730 2.1597 2.5855 2.7876 2.2689 1.9643 1.2052 1.4057 1.3745 1.9637 1.4644 1.9478 2.2938 2.2803 1.8961 2.3953 2.1198 1.9492 3.1345 3.0386 2.6282 2.4395 2.9234 2.4109 2.6466 1.6363 1.3271 2.6345 2.8001 1.4532 1.6126 1.4382 2.2541 1.6882 1.8921 1.9644 1.5255 1.6117 1.4413 1.6164 1.6573 1.6219 1.9409 2.1753 2.4753 2.4426 2.6138 2.1491 3.5511 2.1701 2.5582 1.7540 2.2984 1.7110 2.1234 2.3806 2.3898 2.2662 1.3099 1.4520 1.3085 1.2456 1.2407 1.3229 1.1452 1.2762 1.4165 1.4241 1.1863 1.3264 1.2332 1.3586 1.3914 1.4397 1.2895 1.3024 1.3882 1.2726 1.4307 1.3871 1.0759 1.0791 1.0779 1.0716 1.0581 1.0646 1.0886 1.0759 1.0613 1.0885 1.0553 1.0850 1.0948 1.0895 1.0764 1.0739 1.0715 1.0702 1.0723 1.0711 1.0607 1.0661 1.0376 1.0362 1.0869 1.0674 1.0802 1.0887 1.0958 1.0881 1.0865 1.0879 1.0944 1.1021 1.0980 1.0983 1.0991 1.0996 1.0444 1.0448 1.0972 1.0973
irintensity: 0.2642 0.2493 1.3260 0.0409 1.9165 3.3367 1.5793 2.2132 0.2050 2.8803 0.9347 3.5044 26.5252 4.3695 30.1998 11.9571 5.2979 12.9933 10.5580 1.7915 19.0954 0.3255 6.7233 4.2175 9.2009 3.5740 2.8365 9.9169 34.2047 277.7242 218.1551 1.4176 3.3963 14.4851 2.8003 1.0358 0.8391 14.2209 2.9871 2.9852 4.3430 0.9416 5.3988 2.5665 4.9674 3.2196 24.0582 21.6831 8.2896 14.4449 9.4161 9.7756 18.9997 3.8167 26.2747 12.1787 14.1937 10.6227 36.3474 57.1433 30.3551 9.7263 0.5418 6.2322 1.0389 15.5250 3.1796 3.4970 19.2755 8.2309 6.4700 4.5622 4.6054 3.0020 15.3863 4.8957 5.8332 8.8048 17.9885 20.8476 18.9003 16.9604 4.6005 0.4151 8.2184 2.0983 0.2101 11.0303 8.8368 15.9091 12.2429 11.4402 0.8327 4.9601 12.4548 6.2051 39.0772 32.9916 26.2998 111.2026 43.6347 39.1046 64.1146 287.5802 27.1685 51.8820 26.9831 28.6519 23.2920 28.3084 59.6405 28.8986 66.8299 1.9166 15.0394 24.7463 91.5323 51.3998 43.1441 44.0659 41.0869 29.9088 1.5135 2.8205 0.0635 0.0816
temp: 298.150 k
press: 1.00000 atm
elementType: 7 7 7 7 6 6 6 6 6 6 6 6 6 6 6 6 1 1 1 1 1 1 1 1 1 1 1 1 1 1 1 1 1 1 1 1 1 1 1 1 1 1 1 1
symmnumber: 1
zpe: 1046849.2 jmol-1
zpe.correction: 0.398724 hartree
zpe.thermalcorrener: 0.418437 hartree
zpe.thermalcorrenthalpy: 0.419381 hartree
zpe.thermalcorrgfe: 0.349686 hartree
zpe.sumelectzpe: -691.685078 hartree
zpe.sumelectthermal: -691.665365 hartree
zpe.sumelectthermalent: -691.664421 hartree
zpe.sumelectthermalfe: -691.734116 hartree
dipole: 1.0844 0.4256 1.7572
dipole: 2.1083
quadrupole: -93.8263 -100.4534 -106.1333
quadrupole: 4.7322 -8.6064 -1.3146
quadrupole: 6.3113 -0.3157 -5.9956 4.7322 -8.6064 -1.3146
hfenergy: -692.0838014 hartree
pointgroup: C01 [X(C12H28N4)]
dipole: 0.4191638 -0.2207696 -0.6808778 debye
polarizability: 184.2592655|1.264873|153.0970745|3.7857309|-1.6412991|137.2634095 unknown
InChI: InChI=1S/C12H28N4/c1-11-9-16(8-4-6-14)12(2)10-15(11)7-3-5-13/h11-12H,3-10,13-14H2,1-2H3
charge 0 multiplicity 1
44 atoms
N  -1.457556 -0.505174 -0.326844
N  1.366126 -0.476192 0.340738
N  -5.153015 1.366155 1.317285
N  4.868135 2.022385 -0.655591
C  -0.692337 0.772895 -0.372365
C  0.593345 -1.757147 0.404672
C  -0.597274 -1.680311 -0.578447
C  0.4647 0.667694 0.642966
C  -2.717153 -0.537923 -1.106831
C  2.57177 -0.468644 1.213497
C  -0.179521 1.191682 -1.779646
C  1.458049 -2.985549 0.051877
C  -3.752045 0.516008 -0.653921
C  3.505878 0.737996 0.971958
C  -4.151777 0.388473 0.841611
C  3.974906 0.856252 -0.491821
H  -1.367035 1.568828 0.00078
H  0.165525 -1.89089 1.433639
H  -0.191074 -1.705183 -1.621609
H  -1.215275 -2.589069 -0.444809
H  1.050464 1.602591 0.609329
H  0.026523 0.570008 1.669155
H  -2.541706 -0.429736 -2.208139
H  -3.156829 -1.545985 -0.961266
H  2.286325 -0.497498 2.298152
H  3.145116 -1.389407 1.007348
H  0.60886 0.503872 -2.130568
H  -0.997793 1.206959 -2.522755
H  0.25203 2.209012 -1.736936
H  0.808268 -3.864054 -0.116888
H  2.032276 -2.795311 -0.873548
H  2.165045 -3.253916 0.855188
H  -4.658178 0.39875 -1.283888
H  -3.375956 1.541797 -0.845697
H  4.388236 0.614684 1.634872
H  3.033796 1.693155 1.266578
H  -3.24694 0.478304 1.468718
H  -4.547194 -0.630315 1.023116
H  3.089145 0.998096 -1.136073
H  4.433719 -0.117708 -0.796872
H  -6.05502 1.308396 0.832383
H  -4.808646 2.331377 1.350621
H  5.065345 2.270885 -1.62984
H  5.727043 1.968156 -0.097532
