program: Gaussian 09
title: 000225280
version: EM64L-G09RevD.01
frameworkgroup: C1[X(C20H32O)]
method: RPBEPBE
basis: SDD
operation: Freq
keyword: #pfreq=noraman
keyword: PBEPBE/SDD
title: #p freq=noraman PBEPBE/SDD
converged: YES YES NO NO
title: Mulliken charges:
elementType: O C C C C C C C C C C C C C C C C C C C C H H H H H H H H H H H H H H H H H H H H H H H H H H H H H H H H
charge: -0.431576 -0.256587 -0.443661 -0.443540 -0.399375 -0.399352 0.639827 -0.383069 0.357146 0.401208 0.150660 0.070790 -0.629532 -0.731442 -0.128888 -0.732671 -0.732701 -0.753187 -0.699224 -0.699134 -0.753993 0.204340 0.192494 0.214875 0.214884 0.192663 0.198008 0.191362 0.191346 0.198037 0.186258 0.198048 0.253761 0.263915 0.199301 0.208703 0.263604 0.208692 0.199300 0.263631 0.218764 0.215371 0.215357 0.234057 0.214391 0.205418 0.214545 0.234237 0.204965 0.219399 0.222064 0.222036 0.334473
chargesum: 0.00000
title: Mulliken charges with hydrogens summed into heavy atoms:
elementType: O C C C C C C C C C C C C C C C C C C C C
charge: -0.097103 -0.052248 -0.036291 -0.035993 -0.010005 -0.009969 0.639827 0.001237 0.357146 0.401208 0.150660 0.070790 -0.375771 -0.467527 -0.128888 -0.061063 -0.061078 -0.103695 -0.045357 -0.045387 -0.090495
polarizability: 2.60638869e+02 1.30687081e+00 2.33792631e+02 -1.93913804e-02 -2.00860121e-02 1.68055768e+02
1716.lowfreq: -9.3355 -0.0007 -0.0003 0.0007 8.1956 10.4455 20.5269 42.0219 56.0940
frequency: 19.5129 41.5266 55.9154 63.2839 70.5146 106.9244 143.2940 144.1972 160.7437 163.9581 194.2166 209.2504 221.1704 222.5409 229.8079 247.3581 263.7228 270.8441 289.5598 308.4055 310.8098 311.0549 333.3001 336.3776 344.4152 357.8493 378.6183 387.2484 395.7665 403.9577 428.5886 433.5423 448.4189 450.3576 479.2112 518.8846 526.8613 598.9790 624.8266 628.0818 643.1211 744.3160 758.4662 781.4452 786.0038 794.1200 811.2567 846.2494 875.0636 879.4731 890.4027 898.7859 908.1520 914.1481 921.9794 929.6158 930.6047 932.2045 944.5389 947.4870 948.1702 1004.8352 1021.9245 1024.8114 1027.5487 1034.7239 1047.6353 1049.4508 1067.7211 1101.4053 1110.2936 1129.0311 1145.4727 1180.5463 1193.2293 1196.6508 1200.8361 1204.4953 1210.2836 1225.8501 1233.9627 1251.8205 1255.4481 1258.7001 1276.2769 1297.2017 1302.2504 1307.0481 1326.9998 1333.0199 1338.8219 1342.8971 1352.8159 1369.2361 1369.6458 1372.9701 1375.3032 1389.3778 1397.8656 1411.1121 1430.0267 1441.5524 1457.0682 1458.8059 1459.1875 1460.9859 1462.0753 1467.0837 1468.5632 1474.0568 1476.3669 1476.6499 1478.0607 1478.5831 1489.5137 1489.7876 1491.2969 1504.4171 1506.5599 1594.5885 1608.7098 2946.6751 2962.5037 2962.9696 2963.1630 2963.9260 2968.7726 2969.1099 2973.4181 2974.5278 2975.5576 2977.8176 2980.6457 3021.3864 3023.9240 3029.0382 3030.9469 3041.3616 3058.5417 3060.8233 3061.4996 3064.6601 3067.9451 3070.7864 3072.8781 3075.0739 3081.5341 3082.6440 3110.7733 3113.9026 3149.5647 3155.3550 3613.3307
redmass: 3.0673 2.8973 3.1410 3.4393 2.7554 3.4563 1.7971 3.1473 2.6078 1.3449 1.2763 1.4961 2.9430 1.7204 2.0289 1.2862 1.6891 1.4459 3.6371 2.2278 2.5362 2.4687 1.0772 3.7138 1.1230 2.1936 2.3240 2.6673 2.6401 2.2645 3.0277 2.7555 3.6969 3.1997 1.6901 2.5739 2.7236 3.4687 4.6319 4.3438 3.8736 4.5501 3.1023 1.5004 3.8139 3.4236 3.0713 1.9603 2.1046 1.7285 2.1611 1.4379 1.6888 1.5196 1.7673 1.7002 1.7104 1.6705 3.0687 1.1963 1.2141 2.1521 1.4824 1.4955 1.3748 1.3750 1.7746 1.2500 1.3251 2.8766 2.4407 2.1488 1.6845 1.4874 2.5052 2.8495 2.3802 2.9693 3.1428 1.7806 1.4136 2.3716 1.2873 1.3324 1.5736 1.4653 1.2557 3.2339 1.3347 1.3755 1.4931 1.5726 1.5894 2.4304 1.1844 1.4350 1.3097 1.1639 1.2410 1.2074 2.6886 2.3214 1.0486 1.0842 1.0559 1.0923 1.0900 1.0684 1.0875 1.0717 1.0970 1.0495 1.0510 1.0606 1.0587 1.1466 1.0515 1.0658 1.0621 6.5705 5.6226 1.0810 1.0605 1.0641 1.0596 1.0652 1.0384 1.0612 1.0368 1.0355 1.0349 1.0375 1.0361 1.0972 1.0951 1.0998 1.1029 1.1033 1.1001 1.0988 1.0992 1.0985 1.0999 1.0983 1.0987 1.1006 1.0992 1.0996 1.0978 1.0971 1.0896 1.0889 1.0645
irintensity: 0.1206 0.9451 0.1132 0.0661 0.2401 0.3527 22.5062 0.2206 0.3985 2.1948 0.4814 3.9981 0.1757 1.2211 10.7691 0.0872 0.0819 54.9448 0.6588 0.5548 9.2954 0.6500 0.2017 3.0358 1.1659 13.2158 0.0822 0.0157 1.5996 7.3576 0.0018 0.2150 4.5525 3.1370 0.3144 0.4326 0.3316 2.2969 0.0151 15.2392 2.8264 0.0463 4.1879 1.2091 4.0610 10.1716 0.8951 8.3270 7.1258 24.0813 10.3905 0.0028 1.2410 0.5326 0.3275 1.3832 4.8174 9.5912 11.4785 1.2787 0.2968 3.7930 2.6719 0.8087 0.4733 0.7353 1.3604 0.1650 0.0032 66.7547 0.0007 32.6910 49.5007 0.6295 8.9243 9.3776 4.2314 7.2100 50.6920 10.7648 1.4012 62.6522 1.6710 5.8715 8.9263 10.2195 0.2088 3.8579 0.0053 0.1295 0.5245 5.3382 4.2000 1.3513 24.8522 10.6702 30.3526 18.9934 29.2173 25.6964 79.9132 25.5021 0.0664 1.4358 0.1848 9.5206 9.1000 7.1430 16.0004 2.6565 3.1519 2.4946 2.8333 1.2139 5.8635 6.8961 11.2651 26.6920 12.6999 1.2515 4.3615 6.2041 33.7621 36.4127 12.4313 59.7760 5.8817 55.0956 38.7465 32.2345 34.9913 68.2478 23.6974 90.7533 87.2925 2.3692 4.6848 127.3903 7.1522 0.0202 13.5212 56.6682 48.2276 118.7988 33.9957 1.4178 81.5325 41.6869 0.3429 21.2259 9.8480 13.9246 54.1672
temp: 298.150 k
press: 1.00000 atm
elementType: 8 6 6 6 6 6 6 6 6 6 6 6 6 6 6 6 6 6 6 6 6 1 1 1 1 1 1 1 1 1 1 1 1 1 1 1 1 1 1 1 1 1 1 1 1 1 1 1 1 1 1 1 1
symmnumber: 1
zpe: 1236508.1 jmol-1
zpe.correction: 0.470961 hartree
zpe.thermalcorrener: 0.494104 hartree
zpe.thermalcorrenthalpy: 0.495048 hartree
zpe.thermalcorrgfe: 0.420112 hartree
zpe.sumelectzpe: -854.908647 hartree
zpe.sumelectthermal: -854.885504 hartree
zpe.sumelectthermalent: -854.884560 hartree
zpe.sumelectthermalfe: -854.959496 hartree
dipole: 0.6969 2.0649 -0.0009
dipole: 2.1793
quadrupole: -130.6539 -121.6914 -134.0262
quadrupole: -5.8018 0.0088 -0.0067
quadrupole: -1.8634 7.0991 -5.2357 -5.8018 0.0088 -0.0067
hfenergy: -855.3796081 hartree
pointgroup: C01 [X(C20H32O1)]
dipole: 0.2716039 -0.8132232 -0.0061774 debye
polarizability: 260.6301123|-1.3907732|233.7977824|-0.152058|0.4725545|168.0593724 unknown
InChI: InChI=1S/C20H32O/c1-19(2,3)16-12-15(14-10-8-7-9-11-14)13-17(18(16)21)20(4,5)6/h12-14,21H,7-11H2,1-6H3
charge 0 multiplicity 1
53 atoms
O  -3.266883 -0.44034 0.005623
C  2.393086 0.70525 0.006533
C  3.120765 0.165935 1.272708
C  3.113076 0.194272 -1.275621
C  4.623837 0.534201 1.273011
C  4.616101 0.562591 -1.277039
C  0.90113 0.376063 0.006637
C  5.329783 0.03426 -0.009856
C  -1.458444 1.159397 0.015046
C  -0.931596 -1.294624 -0.004691
C  -2.482719 2.325226 0.024282
C  -1.391098 -2.782741 -0.017038
C  0.444365 -0.960903 -0.003436
C  -0.064672 1.407388 0.015444
C  -1.866083 -0.20928 0.005209
C  -3.376076 2.262815 -1.252926
C  -3.374361 2.244631 1.301696
C  -1.785333 3.713079 0.033681
C  -2.21487 -3.099081 -1.310033
C  -2.212982 -3.121465 1.271424
C  -0.185521 -3.762448 -0.026979
H  2.494398 1.812204 0.018558
H  3.015363 -0.938267 1.308831
H  2.625737 0.561752 2.180594
H  2.612416 0.610074 -2.171414
H  3.007328 -0.908877 -1.335589
H  5.116419 0.11396 2.17174
H  4.728192 1.637521 1.337827
H  4.720186 1.667062 -1.317846
H  5.103147 0.162464 -2.187873
H  5.321125 -1.075797 -0.022227
H  6.392513 0.34611 -0.009572
H  1.184536 -1.766079 -0.010726
H  0.290681 2.442252 0.022683
H  -4.103504 3.097054 -1.240742
H  -2.757587 2.360043 -2.16487
H  -3.93106 1.313721 -1.304099
H  -2.754803 2.329609 2.214134
H  -4.10223 3.078562 1.301896
H  -3.928776 1.294612 1.340498
H  -2.560026 4.501934 0.039577
H  -1.156857 3.856211 0.932413
H  -1.157791 3.868821 -0.86361
H  -1.586542 -2.937471 -2.204302
H  -2.541326 -4.155928 -1.30164
H  -3.117823 -2.475011 -1.44518
H  -2.537674 -4.178557 1.246252
H  -1.584213 -2.973092 2.167667
H  -3.116865 -2.501141 1.417227
H  -0.561509 -4.802059 -0.036319
H  0.445539 -3.625185 -0.923382
H  0.447471 -3.641987 0.870508
H  -3.453271 -1.408538 0.000809
