program: Gaussian 09
title: 000225275
version: EM64L-G09RevD.01
frameworkgroup: C1[X(C20H18O2S)]
method: RPBEPBE
basis: SDD
operation: Freq
keyword: #p
keyword: freq=noraman
keyword: PBEPBE/SDD
title: #p freq=noraman PBEPBE/SDD
converged: YES YES NO NO
title: Mulliken charges:
elementType: S O O C C C C C C C C C C C C C C C C C C C C H H H H H H H H H H H H H H H H H H
charge: 0.842891 -0.557490 -0.544930 -0.678097 0.563840 0.519534 -0.221803 0.456952 -0.373444 -0.421652 -0.357002 -0.341127 -0.234052 -0.382044 -0.828115 -0.236532 -0.232916 -0.223605 -0.234762 -0.257109 -0.217285 -0.236354 -0.232362 0.270019 0.229623 0.228606 0.250418 0.297590 0.302891 0.239437 0.229543 0.217047 0.301087 0.240409 0.231412 0.229448 0.230682 0.231635 0.232428 0.233209 0.231983
chargesum: 0.00000
title: Mulliken charges with hydrogens summed into heavy atoms:
elementType: S O O C C C C C C C C C C C C C C C C C C C C
charge: 0.842891 -0.557490 -0.544930 -0.408078 0.563840 0.519534 -0.221803 0.456952 -0.143821 -0.193046 -0.106583 -0.043537 0.068839 -0.142607 -0.080438 0.003877 -0.001504 0.005843 -0.004080 -0.025475 0.015143 -0.003145 -0.000379
polarizability: 3.35259383e+02 -2.09617739e+01 2.38505384e+02 1.16957267e+01 2.45784618e+01 1.97918767e+02
1716.lowfreq: -5.7020 -3.0355 0.0016 0.0019 0.0021 3.2474 14.9978 27.0177 39.9481
frequency: 14.8651 26.9884 39.9194 44.2965 51.0217 69.6452 80.1600 116.7373 129.8482 143.3942 157.7841 165.7735 200.0844 219.2734 232.5263 247.2239 259.4564 277.6784 281.8495 363.8154 386.9230 402.2049 406.8393 415.5995 426.1088 462.8570 483.1615 522.2108 533.7235 566.1102 577.7147 612.0384 615.2251 641.3919 649.6297 696.0952 701.5913 710.6487 755.2291 767.8037 776.3283 786.0541 792.3185 806.7828 848.0719 852.2222 866.3634 881.1699 897.6041 928.1587 929.6235 967.6213 976.0816 979.9918 988.2163 989.6460 990.5657 994.6734 998.9203 999.8715 1000.9033 1027.4057 1029.0507 1040.1312 1049.2490 1080.9371 1089.8725 1106.5614 1131.4955 1172.6074 1174.4829 1174.8457 1186.6645 1193.4524 1200.7586 1210.0905 1223.1016 1274.9269 1301.0134 1332.1633 1357.4301 1369.2522 1382.9168 1394.2880 1407.0979 1421.1660 1440.5295 1447.7069 1458.6673 1471.6949 1480.7643 1484.0401 1484.8940 1570.0686 1583.7543 1585.5281 1605.9940 1606.6632 1610.2804 2967.9441 3055.0241 3069.1075 3100.4996 3119.7753 3122.0802 3126.2285 3131.2962 3132.8868 3140.6017 3143.1439 3147.0393 3149.7274 3153.8258 3163.3097 3167.0499 3167.5835 3180.4846
redmass: 5.6977 4.4868 4.5951 4.5015 4.2409 5.3924 4.9791 5.0047 1.5183 2.8970 7.6473 5.9016 4.2641 4.2318 4.3922 4.3791 6.5888 5.0729 5.0137 7.3786 4.1674 2.8574 3.1177 3.8073 5.9568 3.6381 3.5808 4.1195 5.8958 3.3668 5.9736 6.1755 6.4859 6.6983 6.0216 1.6879 1.7526 3.4034 2.0994 1.2307 2.2610 5.6027 5.8494 3.6515 1.2556 1.2618 4.2627 1.2921 8.7389 1.4963 1.4279 1.3559 1.4927 1.4338 5.0600 3.9778 3.3515 1.7630 1.3995 1.3614 1.4085 2.3016 2.1239 2.1006 1.5404 1.6254 1.4627 1.2793 1.4680 1.0616 1.0612 1.1014 2.5075 1.1696 1.1261 2.4965 1.4370 1.4894 2.1065 1.3088 1.6937 5.7752 7.7757 4.3089 1.2376 2.1861 2.2925 2.0513 2.3117 1.1033 2.1726 2.0578 1.1812 5.3411 5.5366 5.9129 6.2400 6.7777 5.9496 1.0430 1.0900 1.0864 1.1005 1.0875 1.0867 1.0869 1.0873 1.0873 1.0889 1.0921 1.0930 1.0941 1.0963 1.0984 1.1016 1.1006 1.0959
irintensity: 1.5757 0.1564 0.2581 0.5359 0.7606 0.7507 1.9253 1.7402 0.7488 1.5901 15.2142 1.9125 3.0239 1.4522 3.5242 2.1884 6.4330 0.0977 0.1938 16.4642 13.4944 0.6149 2.9404 1.3299 50.1277 42.3567 3.5726 27.6309 14.7412 60.8611 11.1852 1.9397 1.9889 1.1522 1.4297 61.8128 41.9084 4.1628 12.3438 89.6790 5.4211 43.9032 32.3620 6.7576 0.5133 2.0753 3.1366 0.1683 60.9665 2.5017 1.6442 0.4650 0.4261 0.1070 1.0454 1.4633 0.1082 0.2383 0.1081 0.3420 0.3735 1.9564 9.7860 7.0821 8.6364 3.0517 13.5564 9.0283 4.8809 4.4855 0.2796 0.6001 3.1634 7.8185 2.1202 18.0052 9.4980 5.2538 29.2750 2.6647 4.5324 3.7107 0.3826 1.9630 23.2571 1.2774 20.1185 10.6066 19.8231 21.4631 3.5399 13.7897 32.7618 2.4610 1.9373 3.0350 2.0654 3.2017 0.5933 21.2122 33.8994 5.8563 6.8350 6.4869 4.4639 3.8955 1.0719 0.7077 17.9373 16.1413 26.2553 2.4587 16.4995 23.1240 48.2814 25.8277 9.1453
temp: 298.150 k
press: 1.00000 atm
elementType: 16 8 8 6 6 6 6 6 6 6 6 6 6 6 6 6 6 6 6 6 6 6 6 1 1 1 1 1 1 1 1 1 1 1 1 1 1 1 1 1 1
symmnumber: 1
zpe: 838018.7 jmol-1
zpe.correction: 0.319184 hartree
zpe.thermalcorrener: 0.340477 hartree
zpe.thermalcorrenthalpy: 0.341421 hartree
zpe.thermalcorrgfe: 0.266720 hartree
zpe.sumelectzpe: -1319.668164 hartree
zpe.sumelectthermal: -1319.646872 hartree
zpe.sumelectthermalent: -1319.645928 hartree
zpe.sumelectthermalfe: -1319.720628 hartree
dipole: -1.9989 3.5532 -4.0398
dipole: 5.7394
quadrupole: -114.7204 -144.9446 -140.6470
quadrupole: -1.4720 3.7536 12.6651
quadrupole: 18.7169 -11.5072 -7.2096 -1.4720 3.7536 12.6651
hfenergy: -1319.9873488 hartree
pointgroup: C01 [X(C20H18O2S1)]
dipole: 0.7168455 1.4401245 1.584615 debye
polarizability: 333.6821729|23.6838665|238.4921915|15.4150066|-24.420907|199.50917 unknown
InChI: InChI=1S/C20H18O2S/c1-16-10-8-9-15-19(16)23(21,22)20(17-11-4-2-5-12-17)18-13-6-3-7-14-18/h2-15,20H,1H3
charge 0 multiplicity 1
41 atoms
S  0.18364 -1.24056 -0.82536
O  -0.00151 -0.564121 -2.312849
O  -0.237487 -2.810376 -0.608448
C  -0.949025 -0.026523 0.555157
C  -0.396203 1.349911 0.42494
C  -2.373869 -0.364889 0.248728
C  2.037074 -1.007947 -0.391486
C  2.614364 -1.633808 0.739841
C  0.729598 1.703192 1.225272
C  -3.174505 -0.89525 1.296592
C  -0.933827 2.327207 -0.458007
C  -2.953128 -0.197689 -1.040998
C  2.752062 -0.227107 -1.314953
C  4.010345 -1.424795 0.909677
C  1.836476 -2.476925 1.734595
C  4.137033 -0.040448 -1.111608
C  1.300137 2.988648 1.148108
C  -4.533552 -1.205756 1.08043
C  -0.360832 3.613314 -0.5351
C  -4.307552 -0.524387 -1.257007
C  4.761657 -0.641427 0.004768
C  0.757225 3.950111 0.263452
C  -5.106403 -1.015796 -0.197936
H  -0.602102 -0.523043 1.476088
H  1.152325 0.96337 1.9166
H  -2.730527 -1.056179 2.286505
H  -1.807242 2.089429 -1.069678
H  -2.32475 0.117481 -1.880734
H  2.222769 0.201603 -2.173043
H  4.508061 -1.894675 1.76615
H  2.524951 -3.053991 2.37379
H  1.220487 -1.844707 2.405579
H  1.14949 -3.169462 1.218942
H  4.716773 0.561973 -1.8184
H  2.162342 3.241608 1.774462
H  -5.139324 -1.604991 1.901159
H  -0.787689 4.356024 -1.21792
H  -4.737245 -0.409494 -2.258134
H  5.836877 -0.508167 0.168135
H  1.197056 4.951647 0.201299
H  -6.158972 -1.265609 -0.371611
