program: Gaussian 09
title: 000225271
version: EM64L-G09RevD.01
frameworkgroup: C1[X(C19H16S)]
method: RPBEPBE
basis: SDD
operation: Freq
keyword: #pfreq=noraman
keyword: PBEPBE/SDD
title: #p freq=noraman PBEPBE/SDD
converged: YES YES NO NO
title: Mulliken charges:
elementType: S C C C C C C C C C C C C C C C C C C C H H H H H H H H H H H H H H H H
charge: 0.188720 -0.831071 0.508813 0.523524 -0.401937 -0.409929 -0.369165 -0.365856 -0.141551 -0.227029 -0.227354 -0.232756 -0.227724 -0.242747 -0.240717 -0.277304 -0.152843 -0.211852 -0.257374 -0.241599 0.290204 0.238630 0.238000 0.267098 0.253546 0.226947 0.227028 0.227708 0.226373 0.229090 0.229250 0.243433 0.256458 0.227707 0.227223 0.229057
chargesum: 0.00000
title: Mulliken charges with hydrogens summed into heavy atoms:
elementType: S C C C C C C C C C C C C C C C C C C C
charge: 0.188720 -0.540868 0.508813 0.523524 -0.163307 -0.171929 -0.102067 -0.112310 -0.141551 -0.000082 -0.000325 -0.005048 -0.001351 -0.013658 -0.011468 -0.033871 0.103616 0.015855 -0.030150 -0.012542
polarizability: 2.77261676e+02 2.70839038e+00 2.24437836e+02 7.67747649e+00 2.06523578e+00 1.59368705e+02
1716.lowfreq: -7.9302 -0.0018 -0.0012 0.0015 2.9456 10.5310 17.4113 27.6538 33.6119
frequency: 16.9341 27.2267 33.6025 38.8842 58.0355 61.6440 126.3375 149.9383 193.3662 222.7933 228.7860 239.5475 284.4720 372.8472 398.6722 401.5995 404.1286 405.7611 468.7876 475.1709 501.6059 581.0292 610.8680 613.9301 614.3447 626.0879 672.7556 692.4409 698.6645 704.5614 707.5409 743.7956 751.2540 785.1955 818.5932 839.8100 847.1729 853.8379 859.1287 903.4592 930.2856 933.3813 968.4634 979.5979 982.7323 984.1347 989.0371 989.7696 990.7989 997.5484 1000.0613 1018.2888 1026.1524 1028.3045 1072.3112 1080.5893 1081.1737 1083.6767 1171.9264 1172.0809 1172.4031 1179.0632 1184.0266 1189.9208 1191.3026 1193.2872 1207.6771 1264.1480 1313.4187 1320.5773 1334.2706 1373.8494 1378.7396 1387.2413 1426.9703 1435.0548 1441.0046 1464.4121 1479.6149 1480.9064 1582.6377 1589.4236 1592.1643 1593.3525 1609.1967 1611.8411 3018.6996 3116.4563 3119.8074 3124.7024 3126.0288 3127.7070 3131.9523 3137.6722 3140.3510 3145.1974 3147.9189 3151.3901 3157.0542 3163.7780 3164.9319 3167.7097
redmass: 4.9745 3.7943 4.1232 3.9550 5.4472 5.2370 5.6813 5.3234 6.0617 4.6337 4.8738 4.5975 4.7114 7.6908 3.4535 2.8444 2.9080 5.9575 3.4606 3.5339 3.8787 5.9244 6.3771 6.3294 5.9120 5.3724 6.8369 2.4199 3.8753 1.7568 1.6567 1.5030 2.1397 2.2795 3.1863 1.2618 4.0117 1.2577 1.2501 1.3715 1.4677 1.4484 1.4012 1.4051 1.5113 4.2801 1.4154 4.5893 5.7388 1.3184 1.3148 3.3655 2.2959 2.1558 2.4155 1.6205 1.6418 1.6045 1.0930 1.0520 1.0592 2.5180 1.2232 1.1298 1.1325 1.1936 1.5979 1.8882 1.3370 1.3024 1.2862 6.8997 8.0009 7.1594 2.2067 2.2130 2.1675 2.0044 2.2493 2.2692 6.0396 6.1012 5.9230 6.0190 6.0488 6.0904 1.0848 1.0870 1.0863 1.0846 1.0863 1.0871 1.0881 1.0913 1.0920 1.0934 1.0958 1.0957 1.0952 1.1015 1.1014 1.1009
irintensity: 0.4363 0.0434 0.0290 0.0467 0.2195 0.4876 0.1711 0.9787 1.1325 0.2675 0.8915 0.8213 0.4483 0.3219 0.2887 0.3187 0.4494 1.9134 8.4080 7.4202 3.7227 11.7039 2.6069 0.3276 5.8370 24.3490 27.1858 28.8644 5.8895 67.5496 58.8112 76.2227 53.9155 19.0257 3.7789 0.3274 0.6552 0.0701 0.1781 1.2873 0.8857 2.7158 0.0969 0.0244 0.4015 1.3670 0.3120 0.7757 0.9045 0.0265 0.8534 30.4430 5.4384 11.4535 24.0302 2.1536 9.7782 13.6929 0.1983 0.1498 0.1454 2.1480 5.4311 3.0941 1.9260 2.8108 3.2103 5.3903 1.1032 2.5287 1.0459 1.4896 0.8138 1.0594 7.3890 15.8228 9.6302 58.1560 9.5937 25.1242 4.0066 14.0524 47.2605 2.1065 7.6350 2.6180 6.0475 5.9619 5.2529 2.0337 0.3120 0.3657 3.9770 11.3329 20.7754 19.5006 23.7346 31.7355 21.1817 33.2974 26.2786 21.7532
temp: 298.150 k
press: 1.00000 atm
elementType: 16 6 6 6 6 6 6 6 6 6 6 6 6 6 6 6 6 6 6 6 1 1 1 1 1 1 1 1 1 1 1 1 1 1 1 1
symmnumber: 1
zpe: 751570.6 jmol-1
zpe.correction: 0.286258 hartree
zpe.thermalcorrener: 0.303346 hartree
zpe.thermalcorrenthalpy: 0.304291 hartree
zpe.thermalcorrgfe: 0.237897 hartree
zpe.sumelectzpe: -1130.300340 hartree
zpe.sumelectthermal: -1130.283252 hartree
zpe.sumelectthermalent: -1130.282308 hartree
zpe.sumelectthermalfe: -1130.348701 hartree
dipole: -0.3681 0.9132 1.1192
dipole: 1.4906
quadrupole: -114.2289 -114.6205 -120.4751
quadrupole: 0.0734 1.5635 -0.9503
quadrupole: 2.2126 1.8210 -4.0336 0.0734 1.5635 -0.9503
hfenergy: -1130.5865981 hartree
pointgroup: C01 [X(C19H16S1)]
dipole: 0.0427606 -0.4407673 0.3844918 debye
polarizability: 275.7132078|-9.2662911|225.1215635|-6.596404|8.7991478|160.2334458 unknown
InChI: InChI=1S/C19H16S/c1-4-10-16(11-5-1)19(17-12-6-2-7-13-17)20-18-14-8-3-9-15-18/h1-15,19H
charge 0 multiplicity 1
36 atoms
S  -0.275824 1.457009 -0.807712
C  0.522909 0.095182 0.298363
C  0.159338 -1.334024 -0.105015
C  2.023697 0.381356 0.297203
C  0.268417 -2.351205 0.880439
C  2.554631 1.316201 1.223691
C  -0.240895 -1.694126 -1.414095
C  2.900689 -0.248281 -0.621039
C  -2.001887 1.54836 -0.17204
C  -0.014059 -3.697679 0.563362
C  3.933822 1.613412 1.236572
C  -0.52228 -3.042191 -1.734285
C  4.281297 0.05352 -0.613449
C  -0.41009 -4.049024 -0.748722
C  4.803048 0.983037 0.314788
C  -2.70634 2.749595 -0.443346
C  -2.640006 0.501608 0.536285
C  -4.042425 2.896675 -0.011814
C  -3.973572 0.665557 0.977528
C  -4.682009 1.857664 0.705408
H  0.124277 0.307544 1.307531
H  0.583515 -2.086922 1.897814
H  1.879395 1.817586 1.927945
H  -0.351368 -0.908437 -2.169758
H  2.504641 -0.981677 -1.331362
H  0.072126 -4.469299 1.336775
H  4.330509 2.334678 1.959845
H  -0.835859 -3.303727 -2.75129
H  4.949063 -0.439584 -1.328863
H  -0.633659 -5.092679 -0.996676
H  5.874374 1.213224 0.322112
H  -2.20921 3.56594 -0.97947
H  -2.12318 -0.443568 0.727021
H  -4.577849 3.828014 -0.228133
H  -4.459193 -0.1499 1.525484
H  -5.716544 1.97656 1.0451
