program: Gaussian 09
title: 000225265
version: EM64L-G09RevD.01
frameworkgroup: C1[X(C13H24ClN5)]
method: RPBEPBE
basis: SDD
operation: Freq
keyword: #p
keyword: freq=noraman
keyword: PBEPBE/SDD
title: #p freq=noraman PBEPBE/SDD
converged: YES YES NO NO
title: Mulliken charges:
elementType: Cl N N N N N C C C C C C C C C C C C C H H H H H H H H H H H H H H H H H H H H H H H H
charge: -0.019393 -0.339353 -0.125863 -0.005258 -0.015338 -0.582935 -0.384807 -0.380050 -0.381597 -0.369442 -0.373220 -0.446920 -0.353371 -0.356765 -0.335103 -0.696237 0.114515 0.062087 -0.255479 0.194880 0.194881 0.193469 0.193489 0.192248 0.192238 0.199398 0.199369 0.190342 0.190340 0.209406 0.209395 0.187752 0.187746 0.195183 0.195185 0.237419 0.237337 0.209603 0.215688 0.209603 0.330286 0.336174 0.343096
chargesum: 0.00000
title: Mulliken charges with hydrogens summed into heavy atoms:
elementType: Cl N N N N N C C C C C C C C C C C C C
charge: -0.019393 -0.009067 -0.125863 -0.005258 -0.015338 0.096335 0.004955 0.006907 0.002889 0.029325 0.007462 -0.028119 0.022128 0.033603 0.139654 -0.061343 0.114515 0.062087 -0.255479
polarizability: 2.74190392e+02 -2.48615130e+00 1.92046168e+02 -6.38865131e-02 1.51741952e-02 1.18568472e+02
1716.lowfreq: 0.0009 0.0017 0.0019 4.7102 6.0889 7.5222 14.4339 23.3760 32.2318
frequency: 14.1606 23.3696 31.7650 38.8602 58.0317 65.3782 74.1024 103.6458 114.3351 115.6922 134.5181 140.2312 151.4974 152.2427 157.5950 179.9828 197.9291 226.5518 229.8959 248.4701 294.2108 305.3624 369.8996 400.7880 414.6870 462.6364 487.8624 503.5060 540.3970 544.3151 553.4444 565.7328 644.8684 673.5135 706.4223 720.9619 723.9190 732.9774 752.2983 789.5265 792.4463 843.8290 866.2520 887.9918 908.1071 913.1344 952.5115 971.6619 983.5215 1002.5033 1018.0727 1023.8872 1037.5802 1061.5040 1065.9591 1079.6755 1080.6314 1083.5000 1115.1267 1136.3538 1158.0215 1185.8034 1211.7671 1215.5390 1236.3984 1245.6953 1249.9627 1267.8942 1270.0754 1280.5555 1280.7907 1288.9183 1291.0614 1299.1908 1300.6151 1308.3385 1330.9543 1348.5544 1355.9966 1358.5525 1364.7933 1377.9997 1387.6853 1437.6205 1460.8558 1460.9208 1464.3106 1465.9750 1469.6316 1474.5294 1475.9214 1476.8841 1480.0691 1485.3011 1488.7986 1495.8322 1532.8051 1571.0753 1623.6219 2950.1820 2950.3132 2952.4474 2955.4021 2958.4732 2961.6287 2968.0031 2969.5962 2971.2132 2983.5244 2988.2517 2989.4814 2994.8818 3002.0262 3011.0166 3022.5972 3032.8278 3041.2624 3051.2352 3067.7611 3070.6660 3554.7687 3560.2616 3714.4318
redmass: 4.2151 5.2587 2.8926 1.9000 5.0873 1.8552 2.5498 1.7828 4.4710 2.8050 2.0672 4.8323 2.4161 6.9108 2.1589 6.6948 4.0739 1.1305 4.9753 4.7064 3.7158 4.2202 4.9836 5.2943 3.6350 3.3805 3.0165 1.2069 4.8415 1.1169 1.0790 5.6797 9.9780 7.0358 10.1056 1.0590 1.0700 1.0895 1.1258 2.9817 1.6752 1.2146 11.4734 1.9026 1.2209 8.5828 5.8711 1.1806 4.7105 4.0508 3.0860 1.0882 3.0578 2.8634 2.9516 2.1540 2.2015 2.3390 2.4027 3.5730 1.5855 1.7223 1.3385 1.4353 3.4398 1.2979 1.5331 6.4771 1.2086 1.3606 1.0239 1.1342 1.0649 1.1165 1.0981 1.3754 1.4223 1.5072 1.6919 1.6337 1.6585 2.0245 1.2176 5.4184 1.0739 1.0751 1.0671 1.0814 1.0820 1.0810 1.0426 2.5533 1.0894 1.0919 1.0933 1.0968 2.9955 3.5041 2.2526 1.0588 1.0588 1.0592 1.0594 1.0590 1.0590 1.0586 1.0582 1.0370 1.0965 1.0979 1.0586 1.0997 1.1014 1.1035 1.1047 1.1051 1.1049 1.1052 1.1007 1.0993 1.0449 1.0764 1.1060
irintensity: 0.0300 0.5092 0.0636 0.3490 0.5530 0.1492 0.5595 1.4828 0.5642 0.7128 1.8694 0.0932 0.7952 2.3611 1.4719 1.0039 0.3628 0.0033 0.2483 1.5334 5.2545 2.8609 7.9315 2.0904 0.6702 2.1155 0.0979 242.4154 12.6001 119.3222 34.5469 4.1311 5.4925 21.2007 0.2672 17.9484 0.0387 5.2622 0.0120 25.5148 6.2477 1.0031 22.5082 5.2043 0.1728 79.7056 5.1399 0.5290 1.5561 0.4398 8.0859 0.0489 4.1776 1.9882 5.2754 2.0168 0.6070 0.6375 8.8557 5.1107 0.1369 0.0777 16.7114 0.0332 49.7578 0.0266 11.7116 160.9543 0.2100 9.9678 0.1207 0.1298 0.2982 0.1848 0.0239 14.4685 29.5809 23.7005 2.9850 5.9996 28.5647 169.9735 10.8877 4.0312 0.0366 0.2308 0.2327 2.9017 6.4270 1.9842 12.4281 298.8911 11.3355 5.1340 34.1194 36.4632 495.3052 1253.9753 225.1971 0.0472 0.1796 0.8558 0.2121 8.3486 15.9249 0.2057 250.9251 34.2972 0.0974 0.0985 38.2257 0.3803 0.3756 0.0020 0.9099 4.5905 106.5136 168.3419 101.7510 54.8625 134.1922 61.3706 53.4530
temp: 298.150 k
press: 1.00000 atm
elementType: 17 7 7 7 7 7 6 6 6 6 6 6 6 6 6 6 6 6 6 1 1 1 1 1 1 1 1 1 1 1 1 1 1 1 1 1 1 1 1 1 1 1 1
symmnumber: 1
zpe: 961028.4 jmol-1
zpe.correction: 0.366036 hartree
zpe.thermalcorrener: 0.388152 hartree
zpe.thermalcorrenthalpy: 0.389096 hartree
zpe.thermalcorrgfe: 0.310731 hartree
zpe.sumelectzpe: -1242.131251 hartree
zpe.sumelectthermal: -1242.109136 hartree
zpe.sumelectthermalent: -1242.108191 hartree
zpe.sumelectthermalfe: -1242.186557 hartree
dipole: -2.4324 -4.4190 0.0006
dipole: 5.0442
quadrupole: -126.2914 -121.8867 -123.9135
quadrupole: -27.0380 -0.0139 0.0063
quadrupole: -2.2609 2.1438 0.1171 -27.0380 -0.0139 0.0063
hfenergy: -1242.4972877 hartree
pointgroup: C01 [X(C13H24Cl1N5)]
dipole: 0.903851 -1.7667598 0.0065927 debye
polarizability: 274.2655266|-0.0067198|191.9697241|-0.1028468|-0.3054156|118.5697816 unknown
InChI: InChI=1S/C13H24ClN5/c1-2-3-4-5-6-7-8-9-10-16-13-18-11(14)17-12(15)19-13/h16H,2-10,15H2,1H3
charge 0 multiplicity 1
43 atoms
Cl -5.709039 3.042826 -0.007644
N  -2.456055 -0.812762 0.004965
N  -4.727361 -1.378341 0.010044
N  -4.00259 0.961883 -0.000509
N  -6.370317 0.434917 0.00445
N  -7.03445 -1.811192 0.014534
C  3.832743 0.355028 0.000457
C  2.587016 -0.559148 0.002766
C  5.164329 -0.429269 0.002415
C  1.255843 0.225388 0.000307
C  6.411879 0.482774 0.000479
C  0.015416 -0.695137 0.003714
C  7.743549 -0.301531 0.002394
C  8.991369 0.611047 0.00042
C  -1.301424 0.103888 -0.000096
C  10.317314 -0.180498 0.002502
C  -3.75521 -0.404037 0.004901
C  -6.008104 -0.907609 0.009651
C  -5.313192 1.264696 -0.000173
H  3.799719 1.018236 -0.889155
H  3.799738 1.022676 0.88674
H  2.621219 -1.221645 0.892942
H  2.621556 -1.226622 -0.883667
H  5.197691 -1.096935 -0.884064
H  5.197476 -1.092882 0.891944
H  1.221757 0.892513 0.886142
H  1.221466 0.886459 -0.890051
H  6.379235 1.150527 0.886904
H  6.379414 1.146503 -0.888972
H  0.04852 -1.350852 0.898412
H  0.049182 -1.358363 -0.88541
H  7.778174 -0.969253 -0.884068
H  7.778004 -0.965203 0.891901
H  8.955795 1.277878 0.886152
H  8.956055 1.273675 -0.888473
H  -1.356151 0.768727 0.883008
H  -1.356443 0.759664 -0.889966
H  10.390726 -0.832183 -0.888738
H  11.193093 0.494306 0.000917
H  10.390552 -0.827766 0.896969
H  -2.303549 -1.822921 0.008559
H  -6.824717 -2.805917 0.018376
H  -7.991031 -1.465843 0.014223
