program: Gaussian 09
title: 000225272
version: EM64L-G09RevD.01
frameworkgroup: C1[X(C20H18OS)]
method: RPBEPBE
basis: SDD
operation: Freq
keyword: #p
keyword: freq=noraman
keyword: PBEPBE/SDD
title: #p freq=noraman PBEPBE/SDD
converged: YES YES NO NO
title: Mulliken charges:
elementType: S O C C C C C C C C C C C C C C C C C C C C H H H H H H H H H H H H H H H H H H
charge: 0.591510 -0.591349 -0.728301 0.513274 0.527548 -0.322437 0.460250 -0.410127 -0.380265 -0.354623 -0.395776 -0.212550 -0.393629 -0.222750 -0.236458 -0.249554 -0.241842 -0.830538 -0.244182 -0.237969 -0.245914 -0.221753 0.323348 0.233732 0.254979 0.247438 0.255056 0.305236 0.234149 0.228882 0.230612 0.227512 0.228436 0.227699 0.269276 0.233608 0.235550 0.230845 0.232155 0.228922
chargesum: 0.00000
title: Mulliken charges with hydrogens summed into heavy atoms:
elementType: S O C C C C C C C C C C C C C C C C C C C C
charge: 0.591510 -0.591349 -0.404954 0.513274 0.527548 -0.322437 0.460250 -0.176394 -0.125287 -0.107184 -0.140720 0.092686 -0.159480 0.006132 -0.005845 -0.022042 -0.013406 -0.099955 -0.008632 -0.007124 -0.013759 0.007168
polarizability: 3.28349531e+02 -1.18607267e+01 2.43462522e+02 1.86925091e+01 2.65960236e+01 1.77894002e+02
1716.lowfreq: -7.2882 -6.2687 -0.0012 0.0007 0.0010 4.7940 16.4810 31.3655 41.9548
frequency: 15.8036 31.3204 41.9510 54.2788 67.1604 75.5841 89.2697 107.0693 119.2757 159.1016 165.1245 191.1609 214.3130 231.6639 246.8148 275.4313 279.4742 298.0862 383.8246 402.1444 405.6635 412.9577 418.9918 452.0572 485.0246 510.3092 538.6761 576.3731 578.3496 611.6499 614.9790 645.6072 650.8978 698.8814 703.9227 718.3022 752.3339 767.2157 780.3212 788.5292 803.5569 808.6794 847.3099 852.8715 862.1445 884.2549 920.5291 925.6348 967.6964 974.0137 978.8324 984.5010 987.7382 989.5056 994.7246 995.9991 996.9081 1004.5872 1027.3002 1028.2704 1037.3329 1047.8457 1078.1881 1085.2362 1100.9670 1130.1708 1168.2783 1172.1443 1173.6964 1185.7638 1191.0103 1198.7260 1206.8605 1218.6123 1271.1845 1291.5891 1329.3595 1352.9043 1373.3068 1379.7221 1391.2404 1403.7735 1419.8505 1438.6690 1444.5599 1458.8260 1472.1207 1477.4085 1480.4311 1483.5176 1574.5366 1580.6302 1586.9059 1604.1812 1604.5620 1609.9727 2981.8851 3059.6513 3062.6743 3087.9471 3112.1126 3121.2858 3122.7431 3124.8547 3127.8913 3131.9446 3139.1427 3140.0499 3145.0583 3149.3527 3160.1569 3160.6486 3165.8580 3171.8621
redmass: 5.8308 4.4705 4.9887 3.7934 3.9434 4.9241 5.0750 1.1860 4.3265 3.8995 5.0197 6.5343 4.9132 5.0177 4.3046 4.9200 4.8733 6.3728 5.6799 3.1027 3.2192 3.4634 5.1249 3.1254 3.4765 3.5395 5.7184 4.0179 4.8980 6.1779 6.4684 6.2356 6.2410 1.6609 1.8034 3.5639 2.0364 1.2152 2.0144 4.7960 3.9809 11.5040 1.2556 1.2574 4.1496 1.2921 1.4382 1.4257 1.3586 1.3861 1.4971 1.5032 5.6136 3.8408 1.3634 1.7214 1.3573 2.8780 2.3429 2.0964 2.0435 1.5366 1.6081 1.4144 1.3181 1.4736 1.0723 1.1072 1.0730 2.4367 1.1538 1.1202 2.4540 1.4139 1.5143 2.2830 1.3074 1.6097 6.5145 8.1797 4.3750 1.2290 2.1770 2.2944 2.0810 2.4067 1.0752 1.2258 1.9369 2.2348 5.6495 5.6516 5.8933 6.4363 6.3900 6.0742 1.0370 1.0871 1.0974 1.0989 1.0887 1.0858 1.0876 1.0851 1.0868 1.0884 1.0920 1.0927 1.0937 1.0964 1.0970 1.1000 1.1016 1.0975
irintensity: 1.1454 0.9862 0.1082 0.0250 0.1397 0.6451 0.2174 0.3653 0.7686 0.4162 2.0230 5.2311 0.4865 1.6115 1.9981 1.6611 2.3000 8.6711 8.8393 2.6836 0.8821 0.1904 4.8464 10.2308 2.0008 1.1664 2.9677 25.9898 25.0085 1.2981 1.8875 0.9785 1.0393 73.7544 25.2507 1.0994 15.0143 78.6460 40.6557 2.1617 0.5957 64.7421 0.1924 0.5769 0.5131 0.9656 1.6153 1.0768 1.3951 0.4153 0.0293 0.2003 0.9492 0.2068 0.0689 1.0858 0.1236 1.0944 2.3404 10.4119 9.8401 11.6807 2.0475 2.9932 13.9901 4.8011 5.8619 0.5399 0.0969 0.6682 1.1886 0.0911 13.6394 3.8197 5.3134 8.5071 1.6837 1.0062 1.7326 0.5071 0.3513 11.6105 2.1233 13.2905 7.6956 23.5245 21.3462 17.4996 9.5071 14.6539 0.9350 2.1063 2.2288 4.1448 3.9749 1.7668 17.2581 3.8559 7.4671 17.6102 5.3903 9.4791 6.3950 2.4821 0.1002 1.9977 18.0865 13.9131 24.6379 29.3380 15.5005 52.2609 28.8382 14.6768
temp: 298.150 k
press: 1.00000 atm
elementType: 16 8 6 6 6 6 6 6 6 6 6 6 6 6 6 6 6 6 6 6 6 6 1 1 1 1 1 1 1 1 1 1 1 1 1 1 1 1 1 1
symmnumber: 1
zpe: 828917.3 jmol-1
zpe.correction: 0.315718 hartree
zpe.thermalcorrener: 0.335886 hartree
zpe.thermalcorrenthalpy: 0.336831 hartree
zpe.thermalcorrgfe: 0.264915 hartree
zpe.sumelectzpe: -1244.600638 hartree
zpe.sumelectthermal: -1244.580469 hartree
zpe.sumelectthermalent: -1244.579525 hartree
zpe.sumelectthermalfe: -1244.651441 hartree
dipole: -1.5416 4.2276 0.0862
dipole: 4.5007
quadrupole: -115.2778 -145.4355 -128.2893
quadrupole: -1.1064 4.0237 8.8061
quadrupole: 14.3897 -15.7680 1.3783 -1.1064 4.0237 8.8061
hfenergy: -1244.9163558 hartree
pointgroup: C01 [X(C20H18O1S1)]
dipole: 0.623153 1.5536269 -0.5773685 debye
polarizability: 326.6206564|20.1406929|218.7059583|19.3285499|-40.5325464|204.3794398 unknown
InChI: InChI=1S/C20H18OS/c1-16-10-8-9-15-19(16)22(21)20(17-11-4-2-5-12-17)18-13-6-3-7-14-18/h2-15,20H,1H3
charge 0 multiplicity 1
40 atoms
S  0.036281 -1.727529 -0.264645
O  -0.453428 -2.819437 0.900728
C  -0.909839 0.046267 0.495056
C  -2.362163 -0.22348 0.233024
C  -0.248884 1.292675 -0.000827
C  1.837097 -1.367476 0.220346
C  2.734246 -0.752802 -0.688534
C  -3.237843 -0.377187 1.340276
C  0.916885 1.755185 0.679085
C  -2.895808 -0.374702 -1.077681
C  -0.735946 2.065375 -1.093994
C  2.221634 -1.829847 1.491676
C  4.072286 -0.588471 -0.239849
C  -4.613307 -0.631138 1.14839
C  1.584816 2.926311 0.268224
C  -4.267834 -0.637795 -1.27056
C  -0.066575 3.23828 -1.504418
C  2.318385 -0.293218 -2.074337
C  3.555176 -1.6419 1.91516
C  -5.135243 -0.756134 -0.158999
C  1.100611 3.67195 -0.832454
C  4.478429 -1.014721 1.045094
H  -0.645165 -0.163128 1.544959
H  -2.834203 -0.298485 2.356104
H  1.296163 1.187856 1.536718
H  -2.229729 -0.333735 -1.947494
H  -1.657594 1.771013 -1.602756
H  1.472454 -2.352773 2.100986
H  4.800213 -0.122492 -0.91484
H  -5.272133 -0.744241 2.016298
H  2.478256 3.258928 0.807964
H  -4.659589 -0.763095 -2.286218
H  -0.463054 3.821563 -2.343211
H  3.203456 -0.077182 -2.696225
H  1.709022 0.628244 -2.026735
H  1.715537 -1.060275 -2.594715
H  3.873348 -1.992498 2.902929
H  -6.200643 -0.961763 -0.310789
H  1.615547 4.584628 -1.152174
H  5.518535 -0.872873 1.359941
