program: Gaussian 09
title: 000225231
version: EM64L-G09RevD.01
frameworkgroup: C1[X(C14H20N4O4)]
method: RPBEPBE
basis: SDD
operation: Freq
keyword: #p
keyword: freq=noraman
keyword: PBEPBE/SDD
title: #p freq=noraman PBEPBE/SDD
converged: YES YES NO NO
title: Mulliken charges:
elementType: O O O O N N N N C C C C C C C C C C C C C C H H H H H H H H H H H H H H H H H H H H
charge: -0.318931 -0.284804 -0.268352 -0.214493 -0.453560 -0.162381 -0.218681 -0.072611 0.107669 0.063924 0.207148 -0.491183 0.131399 -0.514760 0.203779 -0.615406 -0.366136 -0.287176 0.264270 -0.600554 -0.347382 -0.688303 0.258277 0.260590 0.404773 0.251964 0.248652 0.271592 0.245960 0.246651 0.245742 0.206623 0.240473 0.227020 0.198042 0.196957 0.266127 0.251064 0.249712 0.210579 0.229168 0.216559
chargesum: 0.00000
title: Mulliken charges with hydrogens summed into heavy atoms:
elementType: O O O O N N N N C C C C C C C C C C C C C C
charge: -0.318931 -0.284804 -0.268352 -0.214493 -0.048787 -0.162381 -0.218681 -0.072611 0.107669 0.063924 0.207148 0.027684 0.131399 -0.014143 0.203779 0.148797 0.086228 0.180317 0.264270 0.166350 0.047617 -0.031998
polarizability: 2.33720988e+02 1.39002906e+01 2.23627952e+02 8.09965609e+00 -1.67944326e+01 1.26314490e+02
1716.lowfreq: -8.0620 -4.3021 0.0004 0.0006 0.0009 5.7302 21.1655 24.7463 39.1216
frequency: 21.0685 24.6126 39.0665 45.8434 66.4502 77.2387 84.6907 92.9952 110.6288 112.7149 115.7024 121.0968 137.4919 163.7230 193.0111 211.9660 226.1431 236.3952 278.0751 281.8852 299.6775 308.3185 320.3263 349.3364 370.2586 377.3512 395.3971 416.1224 455.0182 470.3668 488.8099 519.7921 585.1984 633.3211 666.3260 672.0022 687.5662 704.0179 710.7209 745.2874 751.7022 763.5114 768.2745 814.3919 865.9343 881.1412 903.9952 924.9570 930.9138 949.2255 962.7164 973.7900 1003.0590 1026.8141 1032.5964 1043.5599 1074.0153 1097.2746 1112.1739 1118.3734 1130.1220 1132.0882 1163.8971 1183.5162 1195.5605 1223.1474 1226.3378 1235.2993 1254.0651 1271.8112 1278.5359 1286.2621 1301.1658 1306.7714 1320.6424 1324.1638 1346.1683 1368.7896 1381.2607 1388.3008 1394.5628 1418.2955 1428.6190 1456.8977 1457.3005 1461.3958 1469.0945 1473.1851 1474.2869 1476.4142 1479.1418 1479.7602 1481.9168 1487.7822 1493.3259 1535.3947 1577.7984 1613.7047 1653.7558 1660.6225 2968.5868 2978.0775 2981.0144 2995.2871 3007.3923 3011.8069 3012.7706 3027.6431 3030.7990 3043.9913 3061.6564 3074.9767 3079.7223 3096.3839 3099.9389 3103.6667 3104.7848 3137.1543 3139.6732 3363.2818
redmass: 4.8962 3.8612 7.6998 3.6303 3.4130 2.3951 3.4169 1.1030 2.7012 2.1052 2.0552 1.9471 4.1996 3.7248 5.7961 3.5507 1.2409 3.4167 3.2233 3.3756 3.7912 3.9697 3.8099 4.9268 5.5971 5.9561 6.5413 3.0581 4.6832 4.5674 7.3452 5.6442 4.4816 5.7565 6.0018 6.8160 5.1957 9.3397 4.7014 11.2492 1.1020 2.8148 4.6076 1.3689 1.9518 1.4457 1.7655 3.2900 4.4266 1.2291 3.3756 3.4675 2.7709 3.2597 3.7543 3.0033 2.5223 2.9900 3.1427 2.4912 1.3009 1.3022 1.6928 1.2465 3.3024 1.6361 2.0201 1.5145 3.0405 2.8096 1.3475 1.1793 1.1356 1.7919 2.0421 1.5137 1.4196 1.4158 4.2629 2.6953 1.2097 1.3083 1.3243 1.4030 1.1545 1.0938 1.3805 1.0477 1.0618 1.0416 1.0698 1.0422 1.0670 1.6087 1.0926 3.4334 7.6793 10.4340 10.2477 9.0010 1.0587 1.0364 1.0591 1.0654 1.0336 1.0328 1.1007 1.0568 1.0604 1.1046 1.0945 1.1004 1.1003 1.1025 1.1041 1.1021 1.1095 1.1025 1.1011 1.0881
irintensity: 0.0959 0.3607 1.8308 0.6903 0.1533 0.4127 0.0390 0.1394 0.6287 0.6212 2.3181 3.4180 2.5226 0.2393 12.8436 7.5477 1.6318 4.5154 11.3591 1.1490 2.2046 1.6659 0.6212 25.6106 1.8482 3.5191 22.0906 7.4549 7.8757 0.8377 39.4972 5.4897 3.3873 0.2726 2.2916 3.0254 5.4021 7.1885 4.4499 16.3020 14.5217 16.8638 1.1162 11.2082 46.3367 53.5586 7.1160 28.6368 11.2396 0.6713 42.7655 55.9905 0.8317 36.7353 38.0771 43.3236 9.5435 83.3544 52.5288 22.3052 0.3547 0.0862 4.6057 53.2999 26.8244 22.9109 4.6610 51.1789 53.2782 5.1315 5.3483 0.9994 15.1722 20.2375 92.5419 12.9679 9.1228 2.2367 40.3463 52.2930 7.9322 33.5809 60.5618 120.2760 9.7223 6.3119 46.5239 19.6741 1.1666 14.5791 4.6662 16.9181 0.7598 218.0791 33.1783 21.2472 2.2939 659.3690 325.2773 253.0880 27.1501 24.9203 27.7512 9.7782 37.4176 29.1218 8.4189 43.6849 7.1469 11.0926 8.4083 54.8074 50.4302 17.8360 7.6225 16.5515 17.9363 0.7979 0.5599 591.2463
temp: 298.150 k
press: 1.00000 atm
elementType: 8 8 8 8 7 7 7 7 6 6 6 6 6 6 6 6 6 6 6 6 6 6 1 1 1 1 1 1 1 1 1 1 1 1 1 1 1 1 1 1 1 1
symmnumber: 1
zpe: 887773.9 jmol-1
zpe.correction: 0.338135 hartree
zpe.thermalcorrener: 0.360850 hartree
zpe.thermalcorrenthalpy: 0.361795 hartree
zpe.thermalcorrgfe: 0.283898 hartree
zpe.sumelectzpe: -1063.789864 hartree
zpe.sumelectthermal: -1063.767149 hartree
zpe.sumelectthermalent: -1063.766205 hartree
zpe.sumelectthermalfe: -1063.844101 hartree
dipole: -2.9200 -1.4691 -0.8140
dipole: 3.3685
quadrupole: -143.8947 -122.9582 -131.1537
quadrupole: -7.0744 5.0437 5.2199
quadrupole: -11.2259 9.7107 1.5152 -7.0744 5.0437 5.2199
hfenergy: -1064.1279995 hartree
pointgroup: C01 [X(C14H20N4O4)]
dipole: 1.0987956 0.6688784 -0.3188071 debye
polarizability: 227.1028475|35.5739168|165.8796146|-16.0365417|39.8480404|190.6809673 unknown
InChI: InChI=1S/C14H20N4O4/c1-4-5-8-22-10(19)7-6-9-15-11-12(16-9)17(2)14(21)18(3)13(11)20/h15H,4-8H2,1-3H3
charge 0 multiplicity 1
42 atoms
O  2.707532 0.857983 -1.287421
O  -1.297036 -1.049039 -1.629402
O  -4.538761 -1.05207 1.805871
O  4.567422 0.801464 0.13397
N  0.381806 0.718071 0.29589
N  -2.543753 0.116606 2.213557
N  -2.919932 -1.022888 0.109734
N  -0.348498 1.266119 2.381283
C  -0.887182 0.153129 0.430279
C  -1.308419 0.509955 1.721479
C  0.675146 1.369977 1.480427
C  1.97525 2.075995 1.758129
C  -1.653075 -0.661899 -0.470613
C  2.793492 2.484762 0.497719
C  -3.402338 -0.669361 1.405971
C  -2.970288 0.505604 3.571363
C  2.407793 -1.566573 -1.783723
C  3.221256 -0.304802 -2.094741
C  3.477915 1.311431 -0.197024
C  -3.837829 -1.857625 -0.698692
C  2.830652 -2.746541 -2.693617
C  2.011382 -4.021317 -2.397777
H  1.739909 2.984814 2.339557
H  2.606139 1.44767 2.417195
H  1.001431 0.661137 -0.527023
H  3.596905 3.166627 0.824228
H  2.149168 3.02114 -0.219283
H  -3.969896 0.080172 3.740994
H  -3.004337 1.604669 3.656966
H  -2.25744 0.116081 4.317339
H  1.327103 -1.370514 -1.92958
H  2.555586 -1.849206 -0.722843
H  4.292834 -0.432395 -1.861162
H  3.092131 0.017416 -3.141612
H  3.911155 -2.956486 -2.558967
H  2.692762 -2.458606 -3.755595
H  -3.345931 -2.042424 -1.664901
H  -4.795846 -1.33269 -0.844886
H  -4.041928 -2.808664 -0.180085
H  2.16417 -4.357764 -1.355305
H  0.930671 -3.833601 -2.53583
H  2.304079 -4.850257 -3.067466
