program: Gaussian 09
title: 000225227
version: EM64L-G09RevD.01
frameworkgroup: C1[X(C13H19N5O2)]
method: RPBEPBE
basis: SDD
operation: Freq
keyword: #p
keyword: freq=noraman
keyword: PBEPBE/SDD
title: #p freq=noraman PBEPBE/SDD
converged: YES YES NO NO
title: Mulliken charges:
elementType: O O N N N N N C C C C C C C C C C C C C H H H H H H H H H H H H H H H H H H H
charge: -0.284824 -0.277218 -0.386235 -0.452634 -0.127118 -0.163192 -0.217817 -0.034706 -0.469894 -0.428069 -0.412249 -0.398630 -0.377727 0.186798 0.142141 0.108909 0.130834 0.210085 -0.617042 -0.600722 0.253466 0.219618 0.208265 0.196012 0.246474 0.177458 0.214398 0.207560 0.199310 0.196394 0.205573 0.300083 0.326681 0.272508 0.242012 0.243011 0.267293 0.246281 0.246916
chargesum: 0.00000
title: Mulliken charges with hydrogens summed into heavy atoms:
elementType: O O N N N N N C C C C C C C C C C C C C
charge: -0.284824 -0.277218 -0.086152 -0.125953 -0.127118 -0.163192 -0.217817 0.218760 -0.042011 0.014416 -0.020392 0.008240 0.024240 0.186798 0.142141 0.108909 0.130834 0.210085 0.140489 0.159767
polarizability: 2.70461064e+02 -3.51238070e+00 1.80703195e+02 1.00215742e+01 -2.44034981e+00 1.15345189e+02
1716.lowfreq: -3.3110 -0.0006 0.0005 0.0006 4.7977 13.5821 32.4929 43.0653 65.6511
frequency: 31.8583 41.7097 65.6318 78.8657 92.5206 109.6635 114.5636 122.1154 139.1046 180.4967 195.8823 204.4337 244.1564 268.1683 299.8447 310.1518 315.7316 342.7412 354.9575 366.0894 376.9304 392.1172 418.8627 453.0191 470.1027 485.4042 491.0699 553.1342 567.3849 618.7534 640.2984 671.2785 697.3030 702.0714 728.5138 762.0880 776.0391 783.8560 803.8122 838.4357 862.2831 872.5089 923.5539 924.7388 959.2775 969.1676 1007.0396 1021.0639 1040.3524 1047.8088 1056.6144 1089.9025 1102.2243 1115.8587 1129.7408 1132.0263 1148.5286 1153.6443 1198.9233 1217.9825 1228.2213 1244.4889 1258.9154 1260.7773 1272.8013 1273.9585 1306.8571 1321.9908 1331.9128 1336.5280 1343.8117 1352.8554 1359.4753 1370.3084 1384.4825 1412.4650 1430.6252 1455.9473 1459.8989 1464.9203 1471.0409 1472.9908 1475.0379 1477.8931 1479.4422 1479.7302 1485.6863 1513.0453 1561.9928 1602.9866 1636.9344 1665.2852 2949.5230 2969.3055 2973.1223 2979.9061 2986.2422 3004.2495 3008.4524 3022.6842 3029.3306 3033.1444 3040.4247 3047.5360 3058.3998 3092.1285 3099.6905 3133.0782 3136.5569 3578.3523 3598.3252
redmass: 4.3560 3.7250 3.9559 3.5127 1.1368 1.4384 3.1083 2.7568 3.8260 3.7433 4.2327 3.4486 4.2727 2.3970 2.6142 1.6168 2.3024 3.2939 4.7694 2.5548 4.1531 4.4411 5.1295 3.8553 2.7892 5.6970 2.9270 5.7725 1.1744 2.8643 10.1847 4.3382 9.5161 9.8338 11.0933 4.9752 1.5500 4.2676 3.4520 1.9321 2.3844 1.9515 2.5631 1.9077 2.8113 3.4147 2.8632 2.9763 2.4601 1.5317 1.8799 1.7167 3.6380 1.0533 1.3010 1.2979 2.3275 1.7382 2.5256 1.9226 2.5803 1.3913 2.0873 1.9528 1.3262 3.1875 1.9533 1.7980 1.3441 1.4430 1.8085 1.4943 1.5960 1.5174 3.4153 1.2900 1.3540 1.6765 1.1451 1.0930 1.1385 1.0456 1.0959 1.1029 1.0768 1.0571 1.1691 2.5125 7.6792 7.9331 10.4237 10.1455 1.0680 1.0633 1.0636 1.0641 1.0621 1.0337 1.0326 1.0858 1.0935 1.0957 1.1011 1.1014 1.0989 1.1024 1.1021 1.1024 1.1009 1.0773 1.0815
irintensity: 0.2083 0.2321 0.0931 0.1027 0.1498 1.2988 0.0190 2.5112 1.1632 14.3332 9.9254 4.3609 3.3321 7.0536 2.4534 33.4196 19.4339 8.1646 0.7392 6.9703 12.4892 11.0625 4.5529 2.8338 7.7481 17.0641 10.5723 0.7572 155.2871 3.8365 5.5934 4.9784 1.0533 0.9484 22.3151 1.8053 1.0978 6.0064 5.1461 0.2468 6.7186 9.6930 8.3970 10.3223 19.1415 57.1058 4.2632 15.7428 32.5036 3.0533 4.4337 3.0799 28.4537 0.9919 0.3473 0.1503 21.2116 3.2527 70.7147 89.3100 12.8765 12.2028 22.6668 5.4341 39.5569 9.6401 15.2197 31.5742 0.2513 0.5186 9.9233 4.7484 3.2208 29.9378 50.5634 14.7513 37.2569 105.3492 48.7904 1.5026 32.8579 20.0307 10.4397 26.8472 1.5272 19.2233 105.6806 322.4774 274.1145 842.3809 418.4104 454.4847 35.8153 37.2181 27.9604 22.4319 24.0251 37.3848 36.7553 36.1415 77.1188 52.2579 33.6430 67.1303 50.5178 20.1670 20.2128 0.7195 0.5624 79.4726 66.5770
temp: 298.150 k
press: 1.00000 atm
elementType: 8 8 7 7 7 7 7 6 6 6 6 6 6 6 6 6 6 6 6 6 1 1 1 1 1 1 1 1 1 1 1 1 1 1 1 1 1 1 1
symmnumber: 1
zpe: 843463.9 jmol-1
zpe.correction: 0.321258 hartree
zpe.thermalcorrener: 0.340226 hartree
zpe.thermalcorrenthalpy: 0.341170 hartree
zpe.thermalcorrgfe: 0.273817 hartree
zpe.sumelectzpe: -929.539748 hartree
zpe.sumelectthermal: -929.520781 hartree
zpe.sumelectthermalent: -929.519837 hartree
zpe.sumelectthermalfe: -929.587190 hartree
dipole: -7.5241 -0.4208 -0.5862
dipole: 7.5586
quadrupole: -122.4534 -122.2207 -118.5823
quadrupole: 3.3849 0.6931 0.8176
quadrupole: -1.3679 -1.1352 2.5031 3.3849 0.6931 0.8176
hfenergy: -929.8610069 hartree
pointgroup: C01 [X(C13H19N5O2)]
dipole: -2.9610897 -0.136751 -0.2381003 debye
polarizability: 270.3840937|-4.4745857|180.8521279|10.0328447|-0.4826363|115.2732266 unknown
InChI: InChI=1S/C13H19N5O2/c1-17-10-9(11(19)18(2)13(17)20)15-12(16-10)14-8-6-4-3-5-7-8/h8,14-15H,3-7H2,1-2H3
charge 0 multiplicity 1
39 atoms
O  2.896107 -2.804712 0.133151
O  4.513888 1.638922 0.194346
N  -2.166495 -0.634661 -0.527022
N  0.083886 -1.520547 -0.223763
N  -0.192902 0.751406 -0.319771
N  2.199719 1.334005 -0.063915
N  3.69006 -0.556169 0.160777
C  -3.090587 0.519642 -0.668073
C  -4.405415 0.037391 -1.328276
C  -3.374968 1.206958 0.695937
C  -5.254625 -0.85425 -0.386595
C  -4.216165 0.315012 1.637529
C  -5.531416 -0.142248 0.959873
C  -0.818126 -0.468224 -0.358401
C  1.367048 -0.946621 -0.095005
C  1.149717 0.435072 -0.160464
C  2.647155 -1.557559 0.070252
C  3.525687 0.852945 0.102396
C  1.955444 2.786367 -0.132336
C  5.081627 -1.029644 0.33057
H  -2.583454 1.247417 -1.328404
H  -4.180549 -0.489189 -2.276091
H  -4.996583 0.935585 -1.592366
H  -3.92411 2.148795 0.490855
H  -2.413805 1.48872 1.162037
H  -4.738563 -1.819017 -0.189196
H  -6.205737 -1.11787 -0.886895
H  -4.440163 0.864433 2.571642
H  -3.623023 -0.575006 1.933205
H  -6.171182 0.745025 0.772685
H  -6.100508 -0.809943 1.6349
H  -2.562955 -1.5726 -0.491682
H  -0.095988 -2.523032 -0.23308
H  2.92896 3.290082 -0.04338
H  1.288412 3.098693 0.688952
H  1.477818 3.045671 -1.09221
H  5.050647 -2.129345 0.338815
H  5.501696 -0.64777 1.275797
H  5.710449 -0.665029 -0.498195
