program: Gaussian 09
title: 000225223
version: EM64L-G09RevD.01
frameworkgroup: C1[X(C12H18N4O3)]
method: RPBEPBE
basis: SDD
operation: Freq
keyword: #p
keyword: freq=noraman
keyword: PBEPBE/SDD
title: #p freq=noraman PBEPBE/SDD
converged: YES YES NO NO
title: Mulliken charges:
elementType: O O O N N N N C C C C C C C C C C C C H H H H H H H H H H H H H H H H H H
charge: -0.247602 -0.290524 -0.273435 -0.209542 -0.158424 -0.220557 -0.111387 0.129368 0.092061 -0.087218 0.206055 -0.252179 0.161312 0.210779 -0.633596 -0.687599 -0.696484 -0.615501 -0.601321 0.217501 0.230398 0.223254 0.241709 0.242867 0.295863 0.216173 0.202608 0.236753 0.225177 0.217042 0.209745 0.273029 0.243885 0.244006 0.268518 0.248625 0.248641
chargesum: 0.00000
title: Mulliken charges with hydrogens summed into heavy atoms:
elementType: O O O N N N N C C C C C C C C C C C C
charge: -0.247602 -0.290524 -0.273435 -0.209542 -0.158424 -0.220557 -0.111387 0.129368 0.092061 0.130284 0.206055 0.201472 0.161312 0.210779 0.146843 -0.032065 -0.044520 0.145419 0.164463
polarizability: 2.42858449e+02 -1.12822907e+00 1.80496675e+02 3.07848504e+00 4.52581810e-01 1.00549796e+02
1716.lowfreq: -7.1191 -3.2431 0.0004 0.0005 0.0006 2.3331 26.4730 37.3422 55.4628
frequency: 26.4216 37.1847 55.4440 62.3843 78.6358 86.8113 101.7374 118.8674 128.5964 132.3900 150.6400 180.1995 200.4872 213.9520 223.4609 231.8617 242.7849 250.4615 292.6584 320.7325 343.3689 361.4274 368.1931 385.1709 389.4367 415.6758 443.3981 454.5678 506.4131 564.2399 641.9952 646.8855 685.2977 702.6745 720.7354 732.6824 759.1006 802.6291 837.6324 893.8397 915.4407 927.6855 954.6544 957.0050 968.7827 979.7635 1032.4330 1049.4996 1129.9286 1130.5071 1131.9100 1137.1204 1152.0941 1165.8667 1191.0031 1196.1966 1216.6119 1228.6740 1231.8304 1264.6614 1294.1036 1298.0310 1336.5549 1358.8640 1365.0409 1382.0569 1396.9946 1401.8026 1412.7478 1427.4297 1446.4676 1462.1968 1467.6514 1470.2797 1475.1882 1475.9193 1477.8492 1478.9535 1483.4615 1483.9224 1484.8197 1490.0133 1502.8252 1507.4852 1578.0673 1616.2582 1650.9666 2974.8195 2978.2359 2990.1575 2999.5899 2999.6932 3005.7324 3010.9598 3064.4194 3067.4861 3077.1127 3081.5023 3091.7702 3091.8261 3094.4604 3102.4694 3122.3553 3136.8168 3137.5972
redmass: 3.5102 2.7490 1.4473 3.8447 3.2593 1.0688 2.4333 3.6712 1.1567 2.7744 3.3033 2.9021 1.1147 3.9419 1.9347 5.1307 1.4162 6.1820 2.8136 6.7420 3.3174 2.9759 8.4206 3.3691 7.7263 2.6324 4.5916 5.4785 5.2782 8.3601 10.6621 5.5547 11.4206 11.3484 7.5310 11.2404 5.1800 5.1233 3.0398 1.7112 1.9288 1.3433 1.9763 4.0187 1.7149 2.8544 2.6927 3.0969 1.2982 1.2996 1.3005 2.1145 1.7064 2.7173 1.7465 3.1717 5.3482 2.7116 1.2577 6.3342 1.3998 5.1704 1.4287 1.5799 5.8619 1.2137 1.9491 1.2867 1.3078 1.2607 2.2389 1.3054 1.2515 1.0455 1.0957 1.0455 1.0696 1.0430 1.0445 1.0536 1.1901 1.0671 2.3881 2.5298 7.5784 10.8998 9.9515 1.0362 1.0377 1.0803 1.0345 1.0579 1.0336 1.0328 1.1027 1.1019 1.1024 1.0990 1.0995 1.1024 1.1025 1.1021 1.1032 1.1023 1.1010
irintensity: 0.0706 0.0483 1.0929 0.1672 0.0024 0.0012 0.0418 1.2033 0.0886 15.7258 5.7057 0.8312 0.4200 10.2460 3.6903 1.1499 0.5333 0.1279 3.0898 0.0592 6.9210 6.0187 0.0252 2.1094 22.3571 0.6326 7.9051 18.8506 19.1777 1.7621 6.1612 6.0046 1.6281 6.8614 14.3073 16.3321 1.7500 0.4284 5.0478 11.3187 36.1799 35.1053 16.4658 21.0604 2.1998 197.8648 55.8107 6.8976 0.5652 0.0339 0.0790 7.7077 3.4572 101.0684 10.2509 16.8655 22.6446 2.5464 4.3037 47.2105 5.2785 32.7838 61.7301 50.9567 36.2695 22.4779 11.8683 79.7180 1.6246 65.8014 572.2634 7.0156 22.2637 3.5727 19.5336 14.6362 7.2515 16.9069 30.9869 3.7460 22.8139 72.9641 55.8667 340.1405 66.7960 504.2846 465.7648 28.9651 24.5319 7.7091 36.1057 35.9602 38.8839 30.6617 4.7890 18.6260 74.2386 46.5153 38.3319 20.2714 20.1003 18.8775 0.4112 0.7818 0.4362
temp: 298.150 k
press: 1.00000 atm
elementType: 8 8 8 7 7 7 7 6 6 6 6 6 6 6 6 6 6 6 6 1 1 1 1 1 1 1 1 1 1 1 1 1 1 1 1 1 1
symmnumber: 1
zpe: 783588.1 jmol-1
zpe.correction: 0.298453 hartree
zpe.thermalcorrener: 0.318817 hartree
zpe.thermalcorrenthalpy: 0.319761 hartree
zpe.thermalcorrgfe: 0.248529 hartree
zpe.sumelectzpe: -911.347783 hartree
zpe.sumelectthermal: -911.327420 hartree
zpe.sumelectthermalent: -911.326476 hartree
zpe.sumelectthermalfe: -911.397708 hartree
dipole: -5.6626 0.3634 -0.2462
dipole: 5.6795
quadrupole: -113.7933 -116.1113 -111.6483
quadrupole: -2.6131 0.5322 -0.1442
quadrupole: 0.0577 -2.2603 2.2026 -2.6131 0.5322 -0.1442
hfenergy: -911.6462364 hartree
pointgroup: C01 [X(C12H18N4O3)]
dipole: -2.227426 0.1453215 -0.1022766 debye
polarizability: 242.8408347|-1.1939897|180.5006858|3.409494|0.3004001|100.5633992 unknown
InChI: InChI=1S/C12H18N4O3/c1-7(2)6-19-11-13-9-8(14(11)3)10(17)16(5)12(18)15(9)4/h7H,6H2,1-5H3
charge 0 multiplicity 1
37 atoms
O  -2.551327 -0.558372 -0.171409
O  2.570852 -2.551929 -0.03572
O  4.074605 1.917962 0.157427
N  -0.315215 -1.335724 -0.109609
N  1.75543 1.567193 0.059524
N  3.296412 -0.291966 0.059474
N  -0.634763 0.941729 -0.052277
C  0.963869 -0.735862 -0.042903
C  0.722049 0.646564 -0.009173
C  -4.896902 0.118283 -0.211952
C  -1.217034 -0.287979 -0.111536
C  -3.454562 0.636265 -0.188713
C  2.277016 -1.31305 -0.009842
C  3.098494 1.115518 0.09589
C  -0.626024 -2.772703 -0.172449
C  -5.240265 -0.669222 1.072314
C  -5.855525 1.316817 -0.41606
C  1.471214 3.014029 0.095156
C  4.709219 -0.73401 0.097957
H  -4.992952 -0.562323 -1.081775
H  -3.208461 1.234508 -1.085385
H  -3.243032 1.243257 0.711838
H  -1.256677 -3.064988 0.684166
H  -1.163468 -3.007634 -1.106911
H  0.326043 -3.324195 -0.141378
H  -6.267705 -1.072653 1.019821
H  -5.179111 -0.012866 1.961908
H  -4.544458 -1.513273 1.218768
H  -6.903044 0.968363 -0.451589
H  -5.645551 1.856011 -1.358607
H  -5.771886 2.039792 0.418066
H  2.435977 3.539423 0.144167
H  0.85858 3.258556 0.979226
H  0.919013 3.314411 -0.811183
H  4.707828 -1.833211 0.061402
H  5.192719 -0.377304 1.022109
H  5.259543 -0.317919 -0.76174
