program: Gaussian 09
title: 000225226
version: EM64L-G09RevD.01
frameworkgroup: C1[X(C13H18N4O4)]
method: RPBEPBE
basis: SDD
operation: Freq
keyword: #p
keyword: freq=noraman
keyword: PBEPBE/SDD
title: #p freq=noraman PBEPBE/SDD
converged: YES YES NO NO
title: Mulliken charges:
elementType: O O O O N N N N C C C C C C C C C C C C C H H H H H H H H H H H H H H H H H H
charge: -0.268519 -0.266909 -0.415668 -0.231026 -0.413770 -0.164230 -0.071062 -0.219402 -0.391458 -0.526811 -0.353023 0.206924 0.118766 0.072072 -0.362321 0.119627 -0.488941 0.205369 -0.615430 -0.599011 0.174333 0.191470 0.223111 0.234148 0.248761 0.210349 0.196917 0.216046 0.215188 0.335216 0.253220 0.254817 0.272502 0.246957 0.245429 0.267899 0.250602 0.250492 0.377370
chargesum: 0.00000
title: Mulliken charges with hydrogens summed into heavy atoms:
elementType: O O O O N N N N C C C C C C C C C C C C C
charge: -0.268519 -0.266909 -0.038298 -0.231026 -0.078554 -0.164230 -0.071062 -0.219402 0.023123 -0.043902 0.054243 0.206924 0.118766 0.072072 0.068913 0.119627 0.019096 0.205369 0.149457 0.169981 0.174333
polarizability: 2.11410451e+02 3.65996785e+01 1.59889664e+02 -1.42399784e+01 5.44868298e+00 1.77060586e+02
1716.lowfreq: -1.6310 -0.0010 -0.0007 -0.0004 4.3776 6.0507 12.3759 13.9014 18.1778
frequency: 10.4023 13.8908 17.9882 53.0553 69.0735 77.0533 87.4628 90.7978 97.7279 114.4940 118.6542 128.0141 151.5381 184.8279 201.9529 224.5057 253.5867 293.8364 299.6883 329.0000 346.8370 362.7025 368.3674 395.4095 401.4817 454.7772 484.4156 501.0252 505.0295 522.6750 589.4515 638.5689 640.1169 654.3611 675.4112 687.5752 697.3413 705.2729 731.1248 743.7356 766.1591 792.4625 838.4662 874.2681 907.4975 928.1806 957.6928 970.1128 999.3436 1030.3234 1039.7712 1050.3384 1071.9195 1086.7919 1094.7450 1108.6014 1126.7700 1129.4747 1131.5838 1185.4492 1193.2098 1214.2885 1226.3110 1231.4070 1242.6164 1264.9917 1271.7379 1287.2615 1292.2344 1299.0404 1312.3813 1329.1577 1364.6121 1370.0875 1376.2681 1385.0960 1417.1771 1428.4931 1438.3700 1456.9538 1461.0584 1465.7504 1470.1081 1472.2981 1478.0836 1479.2030 1482.1154 1485.5151 1527.8446 1579.1408 1616.7594 1658.7493 1668.5075 2962.6659 2969.9794 2985.0249 2988.4703 2996.6751 3006.5599 3007.0004 3012.0893 3029.1981 3038.9723 3063.1696 3073.4446 3096.3566 3104.2278 3137.5251 3138.6601 3512.5823 3585.5390
redmass: 5.8906 11.6219 6.8989 3.3813 3.1026 2.2921 1.8533 1.4345 1.2069 3.4867 3.9738 3.1137 2.7228 4.5918 7.1054 2.5972 4.6291 3.9967 3.7399 4.8977 4.4666 3.4310 6.1878 6.1784 4.2451 5.3570 6.8514 1.8026 4.7842 4.6397 4.5798 1.3146 5.4245 2.6256 1.9519 3.0647 3.1084 8.5031 1.2233 11.2683 4.9270 1.5633 2.7849 2.4975 1.6776 4.1801 3.2173 3.4143 4.2425 2.6829 2.9748 2.0890 2.2972 2.4408 2.3469 3.4421 1.3650 1.3024 1.3012 1.8484 2.0313 1.7760 2.7390 1.3838 1.3787 4.7831 1.5180 1.1847 1.0775 4.1446 1.5259 1.4897 1.5939 3.8443 1.8554 3.3227 1.2974 1.3214 1.0845 1.2955 1.3350 1.2390 1.1582 1.0456 1.0822 1.0464 1.1896 1.3742 4.1841 8.3290 10.5442 10.4058 8.2593 1.0607 1.0615 1.0667 1.0616 1.0596 1.0969 1.0336 1.0327 1.0992 1.1014 1.1030 1.0953 1.1025 1.1021 1.1025 1.1012 1.0640 1.0819
irintensity: 0.0771 1.4466 0.3672 0.1353 0.2654 0.2565 0.5294 0.1599 0.4109 1.2066 2.7456 0.3969 1.4761 17.4450 1.6909 7.4805 2.1648 3.2124 0.3636 6.6240 13.5811 14.1418 0.0883 20.2704 2.6403 15.2600 23.3633 30.2345 11.9493 5.9196 15.4505 128.5889 0.6476 28.8781 71.9046 14.8543 10.8786 6.0851 13.5147 10.0985 0.5823 0.5121 2.6793 2.5714 4.9078 4.4654 13.1741 32.9291 42.3619 141.9079 60.1168 2.6665 29.0249 34.2823 16.5516 19.9610 4.4728 0.3031 0.0937 17.5411 30.3768 48.6761 5.5938 4.1173 1.0203 24.6275 21.5537 4.0773 2.8380 91.3921 13.0436 35.5851 15.6043 25.4965 35.3631 34.0413 31.2064 68.1197 26.1127 58.7737 61.1607 31.4167 7.2612 18.2830 5.2803 17.4839 20.0661 166.5021 41.5179 7.3628 566.6482 421.9030 218.4596 0.6791 39.9441 28.8037 5.2892 37.6048 3.0738 35.2955 28.0096 13.4001 25.6945 66.2280 23.0810 18.1040 17.3780 0.7387 0.4517 20.5176 63.9144
temp: 298.150 k
press: 1.00000 atm
elementType: 8 8 8 8 7 7 7 7 6 6 6 6 6 6 6 6 6 6 6 6 6 1 1 1 1 1 1 1 1 1 1 1 1 1 1 1 1 1 1
symmnumber: 1
zpe: 813270.1 jmol-1
zpe.correction: 0.309758 hartree
zpe.thermalcorrener: 0.331233 hartree
zpe.thermalcorrenthalpy: 0.332177 hartree
zpe.thermalcorrgfe: 0.254729 hartree
zpe.sumelectzpe: -1024.568581 hartree
zpe.sumelectthermal: -1024.547105 hartree
zpe.sumelectthermalent: -1024.546161 hartree
zpe.sumelectthermalfe: -1024.623610 hartree
dipole: 2.8991 2.4428 0.8307
dipole: 3.8810
quadrupole: -140.2731 -117.1415 -131.2718
quadrupole: -5.9444 8.6340 -3.6064
quadrupole: -10.7110 12.4207 -1.7097 -5.9444 8.6340 -3.6064
hfenergy: -1024.8783388 hartree
pointgroup: C01 [X(C13H18N4O4)]
dipole: 1.1687245 0.5271577 0.8292509 debye
polarizability: 208.9410288|38.1828097|167.1899073|13.4833609|-10.0541341|172.2297637 unknown
InChI: InChI=1S/C13H18N4O4/c1-16-11-10(12(20)17(2)13(16)21)14-8(15-11)6-4-3-5-7-9(18)19/h14,18H,3-7H2,1-2H3
charge 0 multiplicity 1
39 atoms
O  -2.771844 0.975546 -2.457501
O  -4.55497 -2.278899 0.466269
O  6.382946 -2.142604 -1.202673
O  6.487083 0.11144 -1.749464
N  -0.785416 1.600846 -0.150675
N  -2.743673 -1.006625 1.248688
N  -0.834703 0.477149 1.823743
N  -3.652246 -0.658929 -0.96862
C  2.21016 2.188669 0.703655
C  0.940774 2.286264 1.595739
C  2.798831 0.762711 0.630418
C  -0.212346 1.458503 1.107558
C  -1.825044 0.670879 -0.253955
C  -1.829889 -0.000224 0.976409
C  4.070333 0.694732 -0.242535
C  -2.738408 0.394832 -1.328407
C  4.647663 -0.731385 -0.312756
C  -3.699416 -1.370354 0.267018
C  -2.735392 -1.697853 2.552329
C  -4.664199 -1.064389 -1.971178
C  5.905443 -0.822025 -1.154998
H  1.983856 2.549341 -0.32141
H  2.97161 2.882081 1.111402
H  0.631747 3.347698 1.677207
H  1.171561 1.93776 2.617185
H  2.03325 0.066024 0.231854
H  3.029753 0.413031 1.65777
H  4.840565 1.382846 0.155767
H  3.84533 1.049516 -1.266829
H  -0.518456 2.255659 -0.885538
H  4.889878 -1.114817 0.698068
H  3.90827 -1.44305 -0.729632
H  -3.549367 -2.43702 2.54119
H  -2.891058 -0.970683 3.366706
H  -1.766329 -2.200711 2.709005
H  -4.503778 -0.444779 -2.865652
H  -5.678964 -0.908607 -1.569926
H  -4.549438 -2.133412 -2.213379
H  7.207286 -2.172362 -1.760751
