program: Gaussian 09
title: 000225248
version: EM64L-G09RevD.01
frameworkgroup: C1[X(C21H20N4O2)]
method: RPBEPBE
basis: SDD
operation: Freq
keyword: #p
keyword: freq=noraman
keyword: PBEPBE/SDD
title: #p freq=noraman PBEPBE/SDD
converged: YES YES NO NO
title: Mulliken charges:
elementType: O O N N N N C C C C C C C C C C C C C C C C C C C C C H H H H H H H H H H H H H H H H H H H H
charge: -0.286689 -0.267612 -0.177887 -0.056901 -0.164986 -0.219775 -0.499212 0.178742 0.121515 0.074125 0.458990 0.531850 0.132152 -0.662514 0.196042 -0.422126 -0.455595 -0.375591 -0.337803 -0.617047 -0.601683 -0.228107 -0.230763 -0.235735 -0.242291 -0.243121 -0.243137 0.222634 0.254628 0.234833 0.302371 0.233868 0.223351 0.258827 0.244446 0.270721 0.242307 0.251613 0.268426 0.249971 0.250292 0.227919 0.225470 0.228803 0.224688 0.231502 0.228484
chargesum: 0.00000
title: Mulliken charges with hydrogens summed into heavy atoms:
elementType: O O N N N N C C C C C C C C C C C C C C C C C C C C C
charge: -0.286689 -0.267612 -0.177887 -0.056901 -0.164986 -0.219775 -0.276578 0.178742 0.121515 0.074125 0.458990 0.531850 0.132152 0.129319 0.196042 -0.188258 -0.232244 -0.116765 -0.093357 0.147595 0.167007 -0.000187 -0.005293 -0.006931 -0.017604 -0.011619 -0.014653
polarizability: 3.04728237e+02 -2.98554856e+00 2.50816505e+02 1.07206345e+01 1.14473985e+01 2.23171498e+02
1716.lowfreq: -11.0279 -7.3259 -4.8102 -0.0006 -0.0004 0.0003 13.9703 16.1091 24.2888
frequency: 12.7239 15.5511 24.1746 33.3564 51.0873 59.7154 83.6324 89.7984 93.4096 111.7113 125.3426 134.7316 147.0075 155.1178 207.8725 213.5697 235.2377 239.7058 243.1377 259.0999 282.0640 299.7112 325.0851 351.9866 386.8017 389.0181 402.5339 402.7238 413.6119 437.4507 472.3247 488.2118 495.7458 563.8601 586.6326 608.2323 615.6697 627.4027 646.1826 657.1266 699.8660 703.4810 705.4663 712.2568 725.7734 744.6655 753.5101 760.7222 773.8170 827.4623 847.2413 852.8969 857.1867 857.8402 920.9300 929.8523 953.7764 961.8420 971.7663 981.8233 990.2790 991.6942 993.4744 999.2140 1024.7313 1027.3657 1029.0169 1053.4123 1079.7738 1086.1796 1125.7085 1128.9392 1129.8545 1131.9182 1171.6936 1173.3158 1179.1209 1189.2276 1191.7422 1195.2234 1197.7385 1207.7700 1227.5644 1247.3270 1256.3136 1279.6984 1300.3288 1327.8136 1335.5356 1363.8201 1382.4189 1385.4780 1395.3908 1413.3939 1426.6027 1431.8077 1440.9075 1442.3375 1458.7733 1473.7938 1474.7337 1477.2226 1479.7410 1480.5930 1482.0389 1484.4455 1492.1432 1504.8549 1571.5509 1592.7513 1595.6860 1608.9939 1613.3571 1613.7737 1646.6498 2983.9663 2992.1916 3006.8808 3012.1383 3085.2714 3096.1970 3103.9440 3110.2016 3114.9957 3116.3588 3124.5727 3126.6114 3136.5597 3138.4458 3139.7413 3139.7710 3146.8582 3154.7800 3164.2408 3166.6985
redmass: 4.8000 4.2839 4.0059 5.0162 5.0683 5.0129 3.1645 1.5387 1.8385 1.1662 2.3292 3.7634 1.3631 5.1393 4.4851 4.8993 4.8333 5.3807 3.7293 4.5999 4.6181 3.0526 5.9449 3.6157 9.5968 8.0193 2.7950 2.8306 7.4828 6.2789 3.9983 5.4337 4.5024 4.9629 5.6938 6.1779 6.4615 6.8070 5.3942 10.4059 1.9930 6.9715 1.8801 5.4392 5.5905 11.2427 2.0144 2.2445 4.6360 4.2229 1.2570 3.3736 1.7243 2.1816 1.5856 1.4938 3.9509 3.6081 1.3979 1.3886 4.9719 4.1183 1.5387 1.3384 2.6893 2.2128 2.4624 3.0433 1.6247 1.5991 1.9774 1.3467 1.3055 1.3020 1.0830 1.0615 2.4932 1.1281 1.1149 2.9241 2.2116 4.5637 2.6907 1.8243 2.9205 2.9680 6.7167 1.5085 1.2605 3.0071 5.5054 6.7508 2.3871 1.4038 1.2720 3.1865 2.1264 2.1464 1.8167 1.0434 1.2980 1.0530 1.7040 1.3696 2.0971 1.1833 1.0700 2.5002 7.8719 6.0930 6.0871 6.0031 6.6580 9.2500 9.6891 1.0818 1.0342 1.0338 1.0328 1.1019 1.1020 1.1021 1.0880 1.1027 1.0876 1.0864 1.0862 1.0912 1.1024 1.0995 1.0938 1.0959 1.0956 1.1014 1.1002
irintensity: 0.0655 0.0003 0.0013 0.0624 0.2997 0.0258 0.1055 0.1860 0.4215 1.3324 8.1767 3.6567 4.6631 2.2800 5.0147 1.2298 0.5007 1.2081 5.8986 2.3904 0.5151 1.4773 1.2961 11.2021 25.1226 0.6104 0.0909 0.2056 3.0761 11.1796 8.0356 11.2760 11.1343 8.5499 17.7915 1.9391 1.4412 2.3540 19.7444 1.0960 37.1081 17.4748 54.0621 6.1835 11.0179 11.0933 35.7215 40.2432 1.6867 3.0856 0.0538 1.8088 1.1948 0.4029 1.2910 1.2066 20.2892 21.2177 0.2071 0.1458 1.1530 0.8028 0.0774 0.2580 55.7528 9.1886 40.5473 11.5757 0.5039 14.9148 10.1093 1.9535 0.1111 0.2624 0.0551 0.0416 1.7014 2.9564 4.1536 25.7378 16.2003 44.0994 4.3422 1.1889 8.8114 47.0342 44.9278 2.0752 1.8539 5.2718 2.3291 0.6185 15.4749 10.7896 50.4767 213.4989 2.8010 10.9298 57.5535 17.0563 58.1690 19.2132 32.6347 12.2198 30.0818 33.6086 25.6815 117.8991 12.2205 2.3682 1.1858 14.8101 135.2245 477.0642 473.7086 9.2871 41.8250 31.2427 31.2954 13.0668 16.3967 17.0038 10.1461 1.8459 6.6654 0.4569 0.1410 7.9757 0.9137 3.4256 22.2210 29.4066 38.5938 28.7416 12.9261
temp: 298.150 k
press: 1.00000 atm
elementType: 8 8 7 7 7 7 6 6 6 6 6 6 6 6 6 6 6 6 6 6 6 6 6 6 6 6 6 1 1 1 1 1 1 1 1 1 1 1 1 1 1 1 1 1 1 1 1
symmnumber: 1
zpe: 972541.2 jmol-1
zpe.correction: 0.370421 hartree
zpe.thermalcorrener: 0.394681 hartree
zpe.thermalcorrenthalpy: 0.395625 hartree
zpe.thermalcorrgfe: 0.313034 hartree
zpe.sumelectzpe: -1179.830687 hartree
zpe.sumelectthermal: -1179.806428 hartree
zpe.sumelectthermalent: -1179.805484 hartree
zpe.sumelectthermalfe: -1179.888075 hartree
dipole: -4.4233 -0.8573 -0.7603
dipole: 4.5693
quadrupole: -170.2714 -152.5551 -147.5264
quadrupole: 1.3838 1.7998 -4.0143
quadrupole: -13.4871 4.2292 9.2579 1.3838 1.7998 -4.0143
hfenergy: -1180.2011088 hartree
pointgroup: C01 [X(C21H20N4O2)]
dipole: -1.7446117 0.317023 0.2959949 debye
polarizability: 304.8573388|3.5578878|250.0592481|-10.0235794|12.3154624|223.7996532 unknown
InChI: InChI=1S/C21H20N4O2/c1-23-17-19(24(2)21(27)25(3)20(17)26)22-18(23)16(14-10-6-4-7-11-14)15-12-8-5-9-13-15/h4-13,16H,1-3H3
charge 0 multiplicity 1
47 atoms
O  3.656816 1.86983 1.824649
O  5.12843 -1.28239 -1.360729
N  0.772722 0.845648 1.15472
N  0.437781 -0.796801 -0.397855
N  2.816039 -1.140374 -0.982947
N  4.363482 0.274898 0.216808
C  -1.645687 0.174267 0.738328
C  -0.158505 0.048135 0.494521
C  2.038297 0.483483 0.663667
C  1.789959 -0.523513 -0.282514
C  -2.270528 1.313007 -0.095692
C  -2.372909 -1.16841 0.550617
C  3.357364 0.961441 0.984562
C  0.507199 1.886925 2.164631
C  4.156383 -0.752643 -0.750177
C  -3.419468 1.978734 0.401677
C  -2.768207 -1.911641 1.689399
C  -1.752702 1.690532 -1.35931
C  -2.653682 -1.684618 -0.737861
C  2.519954 -2.20392 -1.961943
C  5.777517 0.656566 0.438057
C  -4.041639 3.000531 -0.347657
C  -3.434922 -3.150225 1.548434
C  -2.373993 2.714158 -2.110628
C  -3.319469 -2.920469 -0.881602
C  -3.519743 3.372208 -1.609099
C  -3.713282 -3.658271 0.259777
H  -1.771397 0.452479 1.804414
H  -0.196304 2.636087 1.7636
H  0.082818 1.440272 3.0813
H  1.46455 2.370443 2.412791
H  -3.833699 1.686997 1.375091
H  -2.554169 -1.522481 2.693374
H  -0.865555 1.182722 -1.754666
H  -2.350351 -1.12125 -1.625724
H  3.47994 -2.592216 -2.331669
H  1.928773 -1.797543 -2.800214
H  1.938241 -3.006046 -1.478684
H  5.786954 1.449206 1.200207
H  6.223424 1.017761 -0.502981
H  6.355514 -0.217334 0.780253
H  -4.928985 3.506139 0.049437
H  -3.736432 -3.71323 2.438904
H  -1.963344 2.997215 -3.086418
H  -3.531673 -3.310099 -1.883639
H  -3.99958 4.166178 -2.191964
H  -4.232233 -4.616586 0.145252
