program: Gaussian 09
title: 000225176
version: EM64L-G09RevD.01
frameworkgroup: C1[X(C12H15NO3)]
method: RPBEPBE
basis: SDD
operation: Freq
keyword: #p
keyword: freq=noraman
keyword: PBEPBE/SDD
title: #p freq=noraman PBEPBE/SDD
converged: YES YES NO NO
title: Mulliken charges:
elementType: O O O N C C C C C C C C C C C C H H H H H H H H H H H H H H H
charge: -0.415820 -0.283431 -0.234234 -0.383491 -0.357554 -0.365719 -0.407817 -0.480549 0.165344 0.269760 0.176809 -0.350849 -0.353518 -0.222271 -0.236007 -0.227117 0.197711 0.237379 0.222279 0.208941 0.210129 0.256953 0.250426 0.257113 0.306314 0.274620 0.214759 0.231936 0.229300 0.232304 0.376299
chargesum: 0.00000
title: Mulliken charges with hydrogens summed into heavy atoms:
elementType: O O O N C C C C C C C C C C C C
charge: -0.039521 -0.283431 -0.234234 -0.077177 0.077537 0.065502 0.059265 0.026990 0.165344 0.269760 0.176809 -0.076229 -0.138759 0.009666 -0.006706 0.005187
polarizability: 1.65412118e+02 2.98885860e+01 1.32079701e+02 -9.53515625e+00 1.31154697e+01 1.30679962e+02
1716.lowfreq: -1.8908 -0.0006 -0.0005 -0.0001 6.2796 15.4263 20.0537 21.5843 27.5870
frequency: 20.0040 21.4879 27.2351 48.1149 67.3016 95.3452 101.1050 125.2402 158.8471 192.4620 233.8755 287.8679 315.4627 348.7611 403.0036 415.8082 431.4535 488.9228 502.4197 521.9257 543.8700 581.8036 614.5540 639.5878 657.1978 687.3309 702.2061 737.2906 778.8218 792.2227 831.3664 854.7718 856.3701 911.5554 930.2862 937.4325 983.9400 989.6601 1005.4079 1020.8679 1031.4738 1048.7743 1081.4956 1084.1682 1094.4929 1106.7939 1146.1814 1161.1762 1173.0664 1190.4723 1228.2718 1250.7828 1263.7107 1278.0310 1291.2824 1306.9015 1316.1908 1347.5429 1364.0823 1379.1698 1384.5122 1431.3881 1438.4858 1444.8845 1462.4562 1470.3067 1481.2737 1499.1065 1571.1780 1605.3235 1611.0363 1667.5113 2977.1476 2985.3464 2994.1915 2999.7217 3026.1385 3041.5618 3062.6490 3077.1014 3119.1416 3131.2940 3144.6582 3157.9760 3169.2388 3511.8530 3567.7863
redmass: 6.5230 9.6781 5.4501 5.5299 3.1598 1.9283 5.4415 2.8989 4.2616 3.1591 5.5196 4.4752 3.6831 3.7353 2.7912 3.8915 4.5664 3.8997 1.7941 1.4465 1.9102 4.8086 6.3441 1.3176 5.5111 4.4690 1.4984 1.2633 2.6320 2.3983 2.0257 1.2623 3.6735 2.4242 1.8321 1.7062 1.4166 5.4605 1.3439 2.8337 2.7877 2.3859 1.9136 1.6943 2.4758 2.3431 2.5620 1.4202 1.0585 1.1450 1.3443 1.3894 1.4477 2.0155 1.0824 1.3292 1.3312 1.5033 1.4277 1.6737 9.1821 2.0719 1.0858 1.1844 1.0939 1.8781 1.1049 2.0707 6.3527 6.6499 6.1187 8.2225 1.0617 1.0615 1.0603 1.0637 1.0962 1.0989 1.1023 1.1022 1.0868 1.0871 1.0921 1.0957 1.1006 1.0639 1.0776
irintensity: 1.1133 1.3877 3.1411 6.3704 0.7021 0.3655 1.7261 0.3626 3.4100 3.0709 1.3492 6.1532 7.0966 6.6351 1.3796 9.7250 15.7746 8.5480 27.6328 101.8946 27.1358 16.7896 0.9046 129.8646 4.6776 13.2874 100.0747 23.9232 3.2203 20.0634 1.1877 0.8622 1.8336 10.9566 12.3964 2.5022 1.0815 0.6302 1.3789 14.3697 226.8802 13.8054 5.4696 11.6197 21.3799 31.3107 14.2874 1.5750 0.9679 6.6991 7.8161 5.8777 30.2316 87.7076 0.9508 103.8254 2.1955 9.6832 20.2842 11.2967 1.3795 7.6411 27.7455 32.6475 9.3047 100.3176 14.2572 184.5820 86.7055 57.3613 4.6597 199.2882 20.9520 12.6828 31.4654 38.9334 1.9515 5.1932 69.7358 14.3424 9.9871 2.3069 23.8144 16.8902 19.5800 19.5175 11.5601
temp: 298.150 k
press: 1.00000 atm
elementType: 8 8 8 7 6 6 6 6 6 6 6 6 6 6 6 6 1 1 1 1 1 1 1 1 1 1 1 1 1 1 1
symmnumber: 1
zpe: 658188.5 jmol-1
zpe.correction: 0.250691 hartree
zpe.thermalcorrener: 0.266645 hartree
zpe.thermalcorrenthalpy: 0.267589 hartree
zpe.thermalcorrgfe: 0.203367 hartree
zpe.sumelectzpe: -745.533184 hartree
zpe.sumelectthermal: -745.517229 hartree
zpe.sumelectthermalent: -745.516285 hartree
zpe.sumelectthermalfe: -745.580508 hartree
dipole: 0.9296 -1.6099 -1.5497
dipole: 2.4203
quadrupole: -83.8597 -98.3358 -91.8579
quadrupole: 12.0444 3.4923 -7.0087
quadrupole: 7.4914 -6.9847 -0.5067 12.0444 3.4923 -7.0087
hfenergy: -745.7838745 hartree
pointgroup: C01 [X(C12H15N1O3)]
dipole: 0.3752859 0.610063 0.6274334 debye
polarizability: 164.9172671|-30.4302646|131.8366116|8.5159107|13.2228524|131.4179022 unknown
InChI: InChI=1S/C12H15NO3/c14-11(15)8-4-5-9-13-12(16)10-6-2-1-3-7-10/h1-3,6-7,13-14H,4-5,8-9H2
charge 0 multiplicity 1
31 atoms
O  5.669412 1.333488 -0.974321
O  -1.348786 -2.079988 -1.037164
O  4.297876 1.841582 0.828063
N  -0.340305 -1.168189 0.845038
C  1.936638 -1.806896 -0.048981
C  2.660978 -0.515376 0.385214
C  0.737958 -2.172816 0.859816
C  3.85815 -0.1897 -0.527242
C  -1.337177 -1.197262 -0.118993
C  -2.399214 -0.128467 -0.029439
C  4.58095 1.079954 -0.122582
C  -3.164391 0.127583 -1.195768
C  -2.680171 0.600873 1.15623
C  -4.174914 1.111138 -1.186974
C  -3.695253 1.582811 1.166207
C  -4.440584 1.845362 -0.006688
H  2.646422 -2.659383 -0.034922
H  1.568416 -1.713888 -1.088506
H  1.955802 0.337191 0.370307
H  3.014558 -0.609822 1.4309
H  1.076047 -2.301869 1.905811
H  0.29919 -3.124428 0.513167
H  4.5963 -1.015648 -0.53022
H  3.535871 -0.076932 -1.581042
H  -0.289766 -0.383185 1.494153
H  -2.950143 -0.465217 -2.091077
H  -2.143732 0.387098 2.088867
H  -4.756381 1.304364 -2.095082
H  -3.911063 2.134331 2.087872
H  -5.227158 2.608071 0.002515
H  6.120866 2.173015 -0.685961
