program: Gaussian 09
title: 000225183
version: EM64L-G09RevD.01
frameworkgroup: C1[X(C15H16N4O2)]
method: RPBEPBE
basis: SDD
operation: Freq
keyword: #p
keyword: freq=noraman
keyword: PBEPBE/SDD
title: #p freq=noraman PBEPBE/SDD
converged: YES YES NO NO
title: Mulliken charges:
elementType: O O N N N N C C C C C C C C C C C C C C C H H H H H H H H H H H H H H H H
charge: -0.267468 -0.269935 -0.413116 -0.163369 -0.219999 -0.078204 0.124153 0.072519 0.201259 -0.506605 -0.575787 0.120625 0.204202 0.463088 -0.616084 -0.599897 -0.441751 -0.389408 -0.216756 -0.226452 -0.236842 0.237570 0.254892 0.365944 0.227854 0.235269 0.271687 0.246102 0.245155 0.267463 0.250030 0.249130 0.249672 0.234949 0.235851 0.229301 0.234961
chargesum: 0.00000
title: Mulliken charges with hydrogens summed into heavy atoms:
elementType: O O N N N N C C C C C C C C C C C C C C C
charge: -0.267468 -0.269935 -0.047172 -0.163369 -0.219999 -0.078204 0.124153 0.072519 0.201259 -0.014142 -0.112664 0.120625 0.204202 0.463088 0.146860 0.166725 -0.192080 -0.154459 0.019094 0.002849 -0.001882
polarizability: 2.39388885e+02 -4.20113170e+00 2.16439333e+02 2.17083085e+01 2.86148338e+00 1.22089853e+02
1716.lowfreq: -11.5948 -5.9738 -0.6526 -0.0005 -0.0001 0.0002 7.6144 26.4879 41.4386
frequency: 3.9870 26.4180 41.4227 64.3130 81.3804 97.2782 104.0983 109.2894 118.0226 155.1473 185.0562 191.8983 250.3513 290.0319 302.4806 329.8533 340.7982 350.4871 373.3479 383.8542 395.8397 403.1104 449.3121 482.0895 497.0883 514.6138 556.4319 616.5428 639.8875 655.7067 681.7840 701.5421 703.6561 709.8868 713.9820 744.2279 755.0975 763.7676 767.7465 860.1576 894.7318 927.6733 934.9338 938.1260 965.0267 981.4296 987.7856 990.8617 1000.4136 1010.6124 1027.9002 1041.0747 1083.1794 1106.9539 1130.0693 1131.8986 1156.8502 1174.2499 1177.9607 1188.7966 1198.7079 1210.3745 1227.5468 1228.4285 1264.5470 1300.9935 1304.5892 1324.3751 1333.4336 1371.8503 1379.6292 1387.1115 1417.1707 1427.9837 1439.0348 1458.1896 1461.9127 1472.0102 1473.2873 1478.3580 1479.1090 1482.6399 1485.5514 1526.2369 1577.8791 1590.2186 1611.4140 1614.2633 1658.4463 2986.1191 2993.9610 3006.6550 3011.1672 3055.9021 3074.6003 3095.5633 3102.8272 3114.8614 3121.6630 3136.8001 3137.2055 3138.4343 3149.3849 3167.7854 3547.9361
redmass: 5.4110 4.4873 4.6154 4.0746 1.0507 5.0418 3.7186 1.3885 2.7507 4.3140 4.2686 5.0224 3.9022 3.1099 4.1677 3.9871 3.0031 4.1056 4.0696 5.6155 5.3464 2.8397 5.4449 6.3203 4.5891 6.2431 2.9443 6.3052 5.6109 5.0797 6.2291 1.4166 7.2595 1.7465 5.0661 10.8481 2.4059 2.5898 3.4962 1.2480 1.6795 3.5084 2.6035 1.9346 3.0712 1.3905 3.9252 4.6894 1.3286 2.9843 2.1752 3.0966 1.6078 3.9496 1.3008 1.3023 1.1870 1.1256 1.5315 1.1143 2.7429 2.1002 2.7203 1.7134 5.1719 3.0107 1.6132 1.7537 1.2729 3.7210 7.3928 3.0896 1.3047 1.3125 2.1318 1.1147 2.3101 1.1576 1.0566 1.0484 1.0682 1.8828 1.6583 4.0139 8.2023 5.9444 6.1022 10.5140 10.4519 1.0666 1.0613 1.0336 1.0328 1.1007 1.0949 1.1025 1.1021 1.0881 1.0879 1.1024 1.0901 1.1011 1.0954 1.1013 1.0827
irintensity: 0.1226 0.0372 0.0193 0.2548 0.0060 0.2522 0.1080 1.3083 4.0352 0.3659 6.3436 17.0131 2.6875 2.2293 1.5265 6.5962 9.5695 10.6983 4.8503 1.5149 22.6908 0.1774 1.7663 9.4087 28.7026 3.5763 15.5203 0.1793 0.7973 6.2067 5.3544 113.4882 28.1735 10.3245 4.4638 7.8146 32.2867 15.2251 8.2279 0.5304 0.9011 4.3164 2.4361 2.2815 46.5906 0.0819 1.4581 0.7606 0.2835 0.5663 3.3382 41.6695 9.3870 14.8931 0.3553 0.0752 12.0591 4.5007 20.1234 2.2817 39.3729 27.1905 3.9588 27.3760 17.3117 69.0438 40.4189 41.6935 5.3124 29.9814 0.2609 30.4831 32.2944 68.8893 10.9990 11.6277 144.0170 21.6160 14.0329 13.0703 10.9631 44.8227 138.4051 19.4707 7.0256 1.8078 8.5864 600.7163 387.5015 15.6806 32.8184 37.5775 28.7832 19.2571 13.6513 18.3532 17.7958 7.6994 8.2418 0.7819 5.9461 0.5589 30.9388 17.5040 166.9218
temp: 298.150 k
press: 1.00000 atm
elementType: 8 8 7 7 7 7 6 6 6 6 6 6 6 6 6 6 6 6 6 6 6 1 1 1 1 1 1 1 1 1 1 1 1 1 1 1 1
symmnumber: 1
zpe: 767336.7 jmol-1
zpe.correction: 0.292263 hartree
zpe.thermalcorrener: 0.311182 hartree
zpe.thermalcorrenthalpy: 0.312126 hartree
zpe.thermalcorrgfe: 0.241573 hartree
zpe.sumelectzpe: -949.196436 hartree
zpe.sumelectthermal: -949.177517 hartree
zpe.sumelectthermalent: -949.176573 hartree
zpe.sumelectthermalfe: -949.247126 hartree
dipole: -4.6448 -2.0566 -0.0940
dipole: 5.0806
quadrupole: -128.2132 -120.7776 -119.0110
quadrupole: -0.6187 3.9105 1.7365
quadrupole: -5.5459 1.8897 3.6563 -0.6187 3.9105 1.7365
hfenergy: -949.4886988 hartree
pointgroup: C01 [X(C15H16N4O2)]
dipole: 1.9160141 -0.4212762 0.3831389 debye
polarizability: 241.0701683|0.010468|121.6565958|-8.321306|-18.6036474|215.1913075 unknown
InChI: InChI=1S/C15H16N4O2/c1-18-13-12(14(20)19(2)15(18)21)16-11(17-13)9-8-10-6-4-3-5-7-10/h3-7,16H,8-9H2,1-2H3
charge 0 multiplicity 1
37 atoms
O  -1.413434 1.074217 -2.26551
O  -4.92192 0.815203 0.886129
N  0.443329 0.281418 0.106673
N  -2.753894 0.33651 1.648786
N  -3.161609 0.940403 -0.65803
N  -0.374514 -0.117271 2.190447
C  -0.938583 0.480812 0.032141
C  -1.408672 0.231653 1.329904
C  0.748581 -0.077762 1.412346
C  2.132278 -0.36467 1.920186
C  2.934383 -1.420128 1.092564
C  -1.782457 0.849504 -1.071723
C  -3.685348 0.702969 0.646107
C  3.382385 -0.924447 -0.277961
C  -3.22315 0.073753 3.022435
C  -4.162419 1.318602 -1.681809
C  2.805683 -1.433143 -1.471363
C  4.385579 0.076111 -0.387332
C  3.210778 -0.949839 -2.738479
C  4.795314 0.558512 -1.649735
C  4.205917 0.049297 -2.831336
H  2.720153 0.57355 1.96774
H  2.011639 -0.71999 2.957767
H  1.096551 0.347071 -0.676659
H  2.323239 -2.335413 0.990058
H  3.8233 -1.693087 1.69319
H  -4.311747 0.228232 3.036518
H  -2.730176 0.762753 3.728559
H  -2.980934 -0.96198 3.31432
H  -3.619982 1.475075 -2.625749
H  -4.685742 2.239565 -1.377219
H  -4.911725 0.517873 -1.794117
H  2.040314 -2.216662 -1.409618
H  4.855381 0.472466 0.522059
H  2.749093 -1.351567 -3.646953
H  5.573202 1.327571 -1.713673
H  4.519706 0.425539 -3.810963
