program: Gaussian 09
title: 000225172
version: EM64L-G09RevD.01
frameworkgroup: C1[X(C10H12N6O2)]
method: RPBEPBE
basis: SDD
operation: Freq
keyword: #p
keyword: freq=noraman
keyword: PBEPBE/SDD
title: #p freq=noraman PBEPBE/SDD
converged: YES YES NO NO
title: Mulliken charges:
elementType: O O N N N N N N C C C C C C C C C C H H H H H H H H H H H H
charge: -0.256053 -0.263414 -0.165048 -0.384569 -0.220009 -0.441150 -0.085393 -0.139221 0.135658 0.089015 0.139535 0.135999 -0.367216 0.134014 -0.472966 0.209119 -0.616578 -0.597902 0.367359 0.229734 0.230057 0.236643 0.236897 0.327580 0.274551 0.245713 0.245622 0.268920 0.251534 0.251570
chargesum: 0.00000
title: Mulliken charges with hydrogens summed into heavy atoms:
elementType: O O N N N N N N C C C C C C C C C C
charge: -0.256053 -0.263414 -0.165048 -0.017210 -0.220009 -0.113571 -0.085393 -0.139221 0.135658 0.089015 0.139535 0.135999 0.092575 0.134014 0.000574 0.209119 0.149309 0.174122
polarizability: 2.59238925e+02 7.67721964e-01 1.66381083e+02 3.20607795e-03 -4.13300412e-02 7.87782284e+01
1716.lowfreq: -9.6809 -6.8848 -0.0008 -0.0005 0.0001 2.9668 46.8065 57.7591 67.0200
frequency: 46.7737 57.7526 67.0165 71.7248 98.8515 107.0205 109.6848 120.4935 157.9914 195.0009 230.3547 253.0863 254.7940 316.9380 318.1277 358.7984 372.0993 385.7771 419.0934 453.3402 472.4038 490.5072 569.5726 598.4596 656.3985 670.4576 703.6738 720.0830 732.6301 743.0692 756.9766 768.3284 822.7936 859.7630 920.3653 927.7153 941.8338 967.6599 992.0250 1026.1713 1040.9905 1077.2134 1105.0033 1128.9210 1132.1204 1152.3577 1168.8095 1192.5381 1212.6208 1227.7071 1239.8442 1262.7921 1276.0348 1288.8008 1306.5566 1370.1541 1376.2559 1411.9161 1419.2191 1427.4323 1466.9749 1472.2010 1474.1826 1478.5650 1480.8483 1499.1647 1512.3581 1538.8526 1573.9519 1609.8622 1613.7916 1656.6064 2981.2119 3006.2984 3008.2145 3013.1520 3026.8545 3061.9633 3095.6319 3105.9072 3138.2554 3139.1727 3568.0291 3616.6340
redmass: 3.0279 2.9302 4.5395 4.9334 2.7820 1.5614 1.0592 2.4386 4.4660 6.1445 4.9629 4.9542 5.1672 3.3865 5.6556 4.1722 7.1228 8.8019 1.1218 6.3436 8.8985 7.9174 6.0785 6.2272 9.4988 8.0745 11.0147 5.5296 6.2651 7.9422 1.3074 4.8695 1.2186 6.7209 4.8216 4.4623 4.8465 3.4545 5.2258 3.6691 3.0445 1.6137 3.6931 1.3059 1.2981 1.8888 1.1274 3.5742 1.0795 2.8051 1.6630 4.5670 1.7816 1.7512 2.5200 8.1064 5.7060 2.0149 1.3387 1.2884 1.1281 1.0435 1.2009 1.0818 1.0423 1.2623 2.9726 4.3420 8.1386 7.9392 9.7901 10.6067 1.0572 1.0336 1.0603 1.0327 1.1083 1.1066 1.1026 1.1022 1.1010 1.1026 1.0825 1.0807
irintensity: 3.9312 2.5183 0.0075 2.2720 0.6722 0.9901 0.0003 3.3544 2.3128 22.1127 29.4113 0.6613 7.9552 3.5455 3.6545 10.3376 9.9827 22.6321 128.2086 5.1151 12.4852 19.6041 0.8844 2.6782 0.0232 5.5333 9.0964 4.2605 2.0220 34.5398 84.0530 0.5891 2.6875 1.2174 1.4679 3.4614 32.0028 44.8119 10.4243 24.5489 36.8966 0.0075 15.4996 0.2252 0.1846 9.5558 1.5840 23.9328 0.0338 4.7903 8.6019 36.6714 55.9612 28.4114 222.2319 30.0964 24.1382 95.0121 98.6729 144.0300 5.1580 18.4423 0.1413 4.1382 17.7178 31.2398 104.3835 99.5162 15.0913 128.0289 660.2894 379.2313 72.2110 34.3496 84.5521 26.5878 14.4869 46.9278 18.6209 16.7248 0.3834 0.8198 104.6699 48.9857
temp: 298.150 k
press: 1.00000 atm
elementType: 8 8 7 7 7 7 7 7 6 6 6 6 6 6 6 6 6 6 1 1 1 1 1 1 1 1 1 1 1 1
symmnumber: 1
zpe: 602269.4 jmol-1
zpe.correction: 0.229392 hartree
zpe.thermalcorrener: 0.245807 hartree
zpe.thermalcorrenthalpy: 0.246751 hartree
zpe.thermalcorrgfe: 0.184545 hartree
zpe.sumelectzpe: -865.951169 hartree
zpe.sumelectthermal: -865.934754 hartree
zpe.sumelectthermalent: -865.933810 hartree
zpe.sumelectthermalfe: -865.996016 hartree
dipole: -4.5907 2.9254 -0.0063
dipole: 5.4436
quadrupole: -94.2620 -109.8525 -103.9713
quadrupole: -8.3459 -0.0069 -0.0488
quadrupole: 8.4333 -7.1573 -1.2760 -8.3459 -0.0069 -0.0488
hfenergy: -866.1805609 hartree
pointgroup: C01 [X(C10H12N6O2)]
dipole: -1.82803 0.9276904 -0.6200308 debye
polarizability: 259.1540212|3.1889374|140.9271992|0.2069318|-39.8179001|104.3170164 unknown
InChI: InChI=1S/C10H12N6O2/c1-15-8-5(9(17)16(2)10(15)18)13-7(14-8)6-11-3-4-12-6/h11,13H,3-4H2,1-2H3
charge 0 multiplicity 1
30 atoms
O  2.029508 -2.387616 1.582477
O  4.080502 1.208926 -0.686813
N  1.734741 1.141629 -0.680701
N  -0.654397 -1.084168 0.71247
N  3.038333 -0.568038 0.432503
N  -3.685116 0.74597 -0.489817
N  -0.720783 0.836676 -0.517928
N  -3.551144 -1.197103 0.754055
C  0.668768 -0.712315 0.490526
C  0.594568 0.471525 -0.267905
C  -1.453753 -0.139879 0.098628
C  -2.909363 -0.217694 0.133484
C  -5.115972 0.416002 -0.306203
C  1.906486 -1.325987 0.900735
C  -5.015336 -0.904653 0.560458
C  3.012418 0.633081 -0.33544
C  1.631946 2.381137 -1.474516
C  4.38963 -1.070307 0.774789
H  -1.002076 -1.895332 1.228129
H  -5.618179 0.240814 -1.276325
H  -5.653376 1.22387 0.224537
H  -5.493289 -0.785515 1.549541
H  -5.495125 -1.764394 0.059807
H  -3.305418 1.540338 -0.999859
H  2.654458 2.730788 -1.677578
H  1.073116 3.146665 -0.910434
H  1.103233 2.181787 -2.42176
H  4.257084 -1.991593 1.360515
H  4.936761 -0.314074 1.360835
H  4.961175 -1.274641 -0.145112
