program: Gaussian 09
title: 000225185
version: EM64L-G09RevD.01
frameworkgroup: C1[X(C16H17N5O3)]
method: RPBEPBE
basis: SDD
operation: Freq
keyword: #p
keyword: freq=noraman
keyword: PBEPBE/SDD
title: #p freq=noraman PBEPBE/SDD
converged: NO YES NO NO
title: Mulliken charges:
elementType: O O O N N N N N C C C C C C C C C C C C C C C C H H H H H H H H H H H H H H H H H
charge: -0.277742 -0.269166 -0.302346 -0.185397 -0.163170 -0.222607 -0.098263 -0.361655 0.131346 0.078909 0.272561 0.140393 -0.533940 0.201896 -0.678081 -0.616186 -0.601348 0.192937 0.267076 -0.357878 -0.342498 -0.232916 -0.220895 -0.223842 0.257437 0.267942 0.306129 0.236256 0.288478 0.272465 0.243509 0.245651 0.268983 0.249792 0.250502 0.318868 0.220328 0.273902 0.232160 0.235202 0.235211
chargesum: 0.00000
title: Mulliken charges with hydrogens summed into heavy atoms:
elementType: O O O N N N N N C C C C C C C C C C C C C C C C
charge: -0.277742 -0.269166 -0.302346 -0.185397 -0.163170 -0.222607 -0.098263 -0.042787 0.131346 0.078909 0.272561 0.140393 -0.008562 0.201896 0.152782 0.145439 0.167928 0.192937 0.267076 -0.137550 -0.068596 -0.000756 0.014307 0.011369
polarizability: 2.78207718e+02 -8.34978203e+00 2.21337467e+02 2.09417632e+00 -1.51475941e+01 1.63523696e+02
1716.lowfreq: -4.3419 -2.6601 -0.0008 -0.0006 -0.0005 5.1209 15.6977 22.6067 35.7196
frequency: 15.5898 22.4783 35.6204 56.7676 72.6067 81.8730 99.9425 110.2223 117.7776 121.2787 135.6943 148.0009 165.6334 188.3509 213.5544 239.2384 246.6718 278.6418 294.3832 306.7759 326.9268 351.7332 371.4255 383.0148 397.9325 403.2202 411.5427 423.8387 450.5029 485.9241 506.3904 534.0895 564.9821 613.6600 614.8876 653.5672 660.8964 684.8039 687.3256 702.6532 705.1055 729.6620 747.3938 767.8392 790.7980 796.2348 801.4527 855.6257 937.0312 941.8999 960.3986 974.7534 985.7275 989.5939 1006.2864 1007.5958 1029.2409 1036.8285 1056.3251 1084.5638 1129.8101 1132.0341 1135.7745 1138.3624 1155.1289 1174.8439 1190.8077 1193.6002 1211.5764 1228.3094 1241.8934 1268.8428 1275.9431 1300.2454 1317.0734 1351.5540 1370.7246 1384.6243 1398.4230 1415.0452 1426.2480 1427.7519 1436.0510 1439.9854 1462.2761 1470.7167 1473.9476 1477.5661 1478.7357 1483.6428 1490.3940 1497.5736 1498.1193 1510.8202 1564.9439 1571.4961 1600.5636 1610.4426 1612.3184 1646.0190 2991.4587 3006.1614 3012.8926 3038.1292 3086.1536 3094.7678 3104.7778 3106.5015 3121.5059 3128.4701 3133.5778 3138.8366 3139.2415 3146.7386 3159.6647 3170.9388 3561.9357
redmass: 5.6369 5.1788 4.3143 5.6348 3.0267 1.2809 3.1838 2.8056 1.8129 2.9090 3.0219 3.9682 1.3050 3.2263 6.7007 4.4947 4.3866 4.3532 2.9317 4.9943 2.7904 3.4910 6.6218 7.5943 4.9078 3.1205 6.9346 4.4345 6.3389 5.3548 4.5164 3.0242 1.5883 5.3615 5.3043 9.6639 6.2695 7.0692 5.0838 1.6009 8.9538 5.9915 11.3789 5.0643 2.7667 3.4980 5.4092 1.2508 1.4726 2.9148 5.0340 3.2246 1.4572 4.9632 2.3404 1.7757 2.3084 2.6091 2.8968 1.5764 1.3029 1.3001 1.4797 2.3164 2.3093 1.0579 1.1370 3.1986 4.2461 2.6181 1.5508 4.8358 2.4598 6.4119 1.3278 1.3998 3.3530 9.2052 2.3780 1.3092 1.3374 1.4256 1.9541 2.1103 1.7744 1.8676 1.0494 1.0838 1.0469 1.3419 1.1391 1.6305 1.6450 1.8982 6.1982 7.7527 6.5672 6.0417 10.5949 9.8115 1.0353 1.0337 1.0328 1.0603 1.1029 1.1024 1.1021 1.1028 1.0871 1.1017 1.0874 1.1010 1.1023 1.0922 1.0959 1.1006 1.0777
irintensity: 0.4719 1.0402 0.1750 4.6417 2.6672 0.6104 0.9398 1.0006 0.6199 0.6627 17.7863 1.1131 2.5410 14.5494 0.3492 3.7559 5.4045 2.6184 0.6186 0.0376 13.7301 10.0152 1.1474 12.8805 20.0180 3.4858 0.8729 13.1578 6.7373 26.5170 22.3677 15.2674 91.7261 6.9177 12.9749 0.2965 4.3612 4.4238 6.3989 89.2776 15.5853 3.1578 12.7189 7.9549 34.6482 4.6971 12.3903 1.0000 4.8427 4.0212 40.1464 4.6659 1.3440 0.8673 13.7935 8.3471 17.5647 55.3888 12.0567 16.9861 0.3501 0.1603 7.2268 13.2347 5.3450 0.9088 11.9384 32.1397 58.4781 6.8169 2.5539 64.1042 221.6031 46.1688 1.0895 5.4429 3.9618 1.6217 34.3107 21.8215 61.4028 13.9309 13.1403 113.7591 79.8440 116.0603 19.8644 19.1116 18.3105 60.7371 31.1278 199.0449 80.5741 37.5446 73.9876 18.3160 21.1998 12.5328 635.2330 407.9800 39.5770 35.6655 29.6400 19.9330 11.0803 19.0497 17.2878 1.1330 8.2136 14.1196 2.1997 0.5028 0.8209 20.3143 15.7987 18.9302 17.7109
temp: 298.150 k
press: 1.00000 atm
elementType: 8 8 8 7 7 7 7 7 6 6 6 6 6 6 6 6 6 6 6 6 6 6 6 6 1 1 1 1 1 1 1 1 1 1 1 1 1 1 1 1 1
symmnumber: 1
zpe: 835715.7 jmol-1
zpe.correction: 0.318307 hartree
zpe.thermalcorrener: 0.340525 hartree
zpe.thermalcorrenthalpy: 0.341469 hartree
zpe.thermalcorrgfe: 0.264803 hartree
zpe.sumelectzpe: -1117.669232 hartree
zpe.sumelectthermal: -1117.647014 hartree
zpe.sumelectthermalent: -1117.646070 hartree
zpe.sumelectthermalfe: -1117.722736 hartree
dipole: -4.5317 2.6119 -1.5384
dipole: 5.4521
quadrupole: -142.1006 -142.4693 -132.7147
quadrupole: -13.5256 -11.2090 -2.5718
quadrupole: -3.0058 -3.3744 6.3802 -13.5256 -11.2090 -2.5718
hfenergy: -1117.987539 hartree
pointgroup: C01 [X(C16H17N5O3)]
dipole: 1.9408995 0.0962716 0.9081433 debye
polarizability: 279.3590199|-4.5523121|179.2637121|1.6703408|29.2807142|204.4461487 unknown
InChI: InChI=1S/C16H17N5O3/c1-19-11(9-17-14(22)10-7-5-4-6-8-10)18-13-12(19)15(23)21(3)16(24)20(13)2/h4-8,17H,9H2,1-3H3
charge 0 multiplicity 1
41 atoms
O  -3.696765 -0.909779 -1.788323
O  -4.822231 2.600439 1.153008
O  2.226765 -2.201283 -0.989652
N  -1.206621 -1.351784 0.064637
N  -2.858654 1.401922 1.617848
N  -4.236291 0.842847 -0.285371
N  -0.850769 -0.015926 1.888926
N  2.100808 -1.049394 1.021854
C  -2.268003 -0.432925 0.117235
C  -2.012685 0.368699 1.243611
C  -0.384191 -1.065463 1.145673
C  -3.40781 -0.242834 -0.745425
C  0.900256 -1.781976 1.468802
C  -4.015676 1.674697 0.851051
C  -1.045726 -2.433279 -0.932698
C  -2.56014 2.221201 2.807374
C  -5.453692 1.157027 -1.068841
C  2.699921 -1.317767 -0.199889
C  3.926178 -0.515517 -0.544138
C  4.714736 0.157557 0.426796
C  4.307156 -0.45749 -1.909449
C  5.853353 0.893583 0.03248
C  5.442326 0.280905 -2.302415
C  6.215984 0.962732 -1.333031
H  0.954101 -1.906928 2.563176
H  0.926846 -2.774895 0.993001
H  0.017917 -2.522484 -1.208778
H  -1.408931 -3.391073 -0.519031
H  -1.65645 -2.181177 -1.811743
H  -3.369592 2.957702 2.913731
H  -1.592359 2.735273 2.681186
H  -2.505093 1.580966 3.703618
H  -5.506547 0.433578 -1.895289
H  -5.39772 2.186068 -1.460021
H  -6.345781 1.080261 -0.426531
H  2.374796 -0.223796 1.556099
H  4.476114 0.083387 1.494703
H  3.699866 -1.002599 -2.639304
H  6.461402 1.403259 0.787784
H  5.725672 0.324918 -3.35958
H  7.099129 1.53545 -1.637187
