program: Gaussian 09
title: 000225189
version: EM64L-G09RevD.01
frameworkgroup: C1[X(C18H18Br2N2)]
method: RPBEPBE
basis: SDD
operation: Freq
keyword: #p
keyword: freq=noraman
keyword: PBEPBE/SDD
title: #p freq=noraman PBEPBE/SDD
converged: NO YES NO NO
title: Mulliken charges:
elementType: Br Br N N C C C C C C C C C C C C C C C C C C H H H H H H H H H H H H H H H H H H
charge: 0.012867 0.012848 -0.120949 -0.120880 0.086284 0.086256 -0.495706 -0.495787 0.350334 0.350270 -0.682125 -0.682132 -0.369454 -0.369364 -0.354384 -0.354457 -0.204652 -0.204745 -0.189278 -0.189294 -0.213234 -0.213194 0.214863 0.260678 0.214991 0.260636 0.228072 0.226394 0.228488 0.226336 0.228505 0.228079 0.240040 0.240134 0.279865 0.279871 0.250554 0.250561 0.251351 0.251358
chargesum: 0.00000
title: Mulliken charges with hydrogens summed into heavy atoms:
elementType: Br Br N N C C C C C C C C C C C C C C C C C C
charge: 0.012867 0.012848 -0.120949 -0.120880 0.086284 0.086256 -0.020166 -0.020160 0.350334 0.350270 0.000829 0.000788 -0.129414 -0.129230 -0.074518 -0.074586 0.045902 0.045816 0.062072 0.062064 -0.213234 -0.213194
polarizability: 5.87692156e+02 -1.31601442e+01 1.93763673e+02 3.18224334e-03 2.05406983e-02 1.44158198e+02
1716.lowfreq: -11.4362 -2.3569 -1.6743 -0.0004 -0.0002 -0.0001 15.2761 24.9417 26.6711
frequency: 15.2611 24.8038 26.6699 36.1076 51.0374 63.0672 70.4683 76.7258 77.7766 113.0810 157.0415 168.0832 185.7191 201.7923 209.5364 224.4150 239.2509 241.7923 284.6815 299.2458 301.2540 326.1158 377.2701 388.1540 406.8463 409.8146 440.8222 448.4284 489.3340 504.2071 521.1660 614.2758 622.1744 626.1451 647.5786 668.1739 670.2393 719.5869 723.6075 737.0932 742.9416 799.3517 803.9141 826.4722 827.4432 849.0862 849.1267 914.5306 942.3532 955.8282 956.0069 961.1663 990.0485 990.4191 992.8954 993.3029 1032.5592 1046.1707 1060.2025 1060.8872 1064.6274 1082.8055 1095.0334 1105.3893 1114.7403 1121.4033 1186.9035 1187.7646 1242.2146 1245.1785 1293.6133 1294.6168 1300.8502 1313.0581 1317.8734 1336.6018 1358.0316 1359.4889 1386.8754 1389.4122 1394.5842 1395.7550 1463.8525 1465.9498 1474.0206 1476.2464 1478.7498 1479.3085 1484.8282 1489.1037 1514.3794 1540.0287 1570.9631 1573.9203 1592.1661 1595.2406 2984.5478 2985.0350 2995.0439 2996.2212 3052.6406 3053.4611 3082.9147 3083.2658 3086.7833 3088.7435 3149.3543 3149.3705 3155.9588 3155.9919 3171.8184 3171.8374 3176.2094 3176.2699
redmass: 9.1811 8.5696 3.4879 3.3741 3.7520 6.8224 7.7521 3.3221 3.1925 8.2924 4.1376 8.6370 3.9190 1.6297 1.2930 1.8139 5.4438 5.6544 4.7552 4.5551 3.7810 3.0418 4.7074 4.2614 2.9164 3.0055 4.0182 4.2124 4.2955 3.2166 4.5475 4.7726 7.0415 6.2444 4.1221 4.7308 4.4805 3.8837 3.5225 4.0439 3.1708 1.4392 1.2427 1.3372 1.3556 1.4822 1.4856 2.7222 2.4738 1.3970 1.3707 2.5439 1.7931 1.6985 2.5315 2.7196 2.9894 2.8720 2.5943 2.6583 1.7287 1.8951 1.8414 2.1807 1.3679 1.4372 1.1326 1.1246 1.3876 1.3165 1.2864 1.2548 1.7313 1.4037 1.9604 2.5997 4.4319 4.6503 1.2789 1.2337 4.1018 3.6156 1.4371 1.2538 1.0639 1.4909 1.2660 1.4521 1.0971 1.1176 5.8129 7.9132 7.5102 7.6645 6.1225 6.3499 1.0350 1.0349 1.0589 1.0588 1.1009 1.1010 1.1005 1.1003 1.1013 1.1009 1.0882 1.0882 1.0882 1.0882 1.0961 1.0961 1.0974 1.0974
irintensity: 0.1567 0.0357 0.0153 0.1334 0.8776 0.0937 0.0034 0.4669 0.1633 0.4408 0.8399 0.6938 0.2267 0.3689 1.2325 1.9311 8.6226 0.4798 0.6405 0.0631 1.2571 2.4714 1.7640 4.2151 0.0684 1.0421 4.0649 15.0303 8.5569 25.8836 43.3307 4.6184 0.6641 5.1558 3.4861 0.8483 14.0723 0.7204 5.3708 37.1078 7.2852 3.7883 29.0556 7.4049 18.3757 21.0413 61.7331 0.3249 67.6602 0.2988 0.1914 5.8927 41.7051 3.8063 83.9650 0.4624 4.9276 5.6586 91.7147 1.6100 12.1190 4.5761 16.1795 0.4354 10.8130 0.7815 0.6999 20.9627 0.4977 3.4997 0.1087 0.2245 28.5521 3.6366 51.5611 3.4434 1.4377 17.2173 10.1968 19.2704 11.3353 34.2162 181.9554 1.6503 1.7314 2.3599 0.8677 73.8026 0.6034 25.3577 0.5725 59.0377 1.4545 10.5106 70.7770 2.7745 4.6878 53.2799 31.4588 10.4597 11.0169 1.9955 1.4516 70.3364 93.5367 0.0115 6.4491 8.5019 1.7657 0.3973 7.4290 14.7762 5.7105 0.1982
temp: 298.150 k
press: 1.00000 atm
elementType: 35 35 7 7 6 6 6 6 6 6 6 6 6 6 6 6 6 6 6 6 6 6 1 1 1 1 1 1 1 1 1 1 1 1 1 1 1 1 1 1
symmnumber: 1
zpe: 816478.8 jmol-1
zpe.correction: 0.310980 hartree
zpe.thermalcorrener: 0.333200 hartree
zpe.thermalcorrenthalpy: 0.334144 hartree
zpe.thermalcorrgfe: 0.254727 hartree
zpe.sumelectzpe: -831.530612 hartree
zpe.sumelectthermal: -831.508393 hartree
zpe.sumelectthermalent: -831.507449 hartree
zpe.sumelectthermalfe: -831.586865 hartree
dipole: 0.0009 0.0000 2.2019
dipole: 2.2019
quadrupole: -175.6844 -136.3516 -148.8914
quadrupole: -7.8696 -0.0024 0.0054
quadrupole: -22.0419 17.2909 4.7510 -7.8696 -0.0024 0.0054
hfenergy: -831.8415925 hartree
pointgroup: C01 [X(C18H18Br2N2)]
dipole: -0.0006353 -0.0129419 0.8662015 debye
polarizability: 587.6722347|13.4369956|193.7708098|0.7158231|0.7784146|144.1709824 unknown
InChI: InChI=1S/C18H18Br2N2/c1-3-17(13-5-9-15(19)10-6-13)21-22-18(4-2)14-7-11-16(20)12-8-14/h5-12H,3-4H2,1-2H3
charge 0 multiplicity 1
40 atoms
Br 7.596438 0.875575 -0.970486
Br -7.595334 -0.841353 -1.013676
N  0.668789 0.196869 -0.554195
N  -0.6684 -0.177058 -0.561384
C  1.56789 -0.701822 -0.167491
C  -1.56845 0.709937 -0.150623
C  1.174546 -2.031962 0.455603
C  -1.176708 2.02134 0.511807
C  2.996238 -0.331761 -0.344864
C  -2.99641 0.345453 -0.342024
C  1.073101 -1.967334 2.005403
C  -1.07941 1.91204 2.059339
C  4.042551 -1.144128 0.173149
C  -4.043602 1.14113 0.199644
C  3.354425 0.8556 -1.048426
C  -3.353189 -0.819241 -1.083105
C  5.398836 -0.794224 -0.005287
C  -5.399551 0.797067 0.007822
C  4.700945 1.214936 -1.239166
C  -4.699368 -1.172346 -1.287461
C  5.714148 0.382601 -0.712151
C  -5.713501 -0.356878 -0.736398
H  1.891359 -2.819298 0.160872
H  0.182825 -2.304073 0.047741
H  -1.89264 2.816959 0.237892
H  -0.183734 2.304774 0.114768
H  0.791041 -2.954365 2.4137
H  2.031572 -1.665996 2.465422
H  0.302605 -1.239478 2.316171
H  -2.039509 1.599319 2.50821
H  -0.310861 1.174264 2.350919
H  -0.796692 2.886472 2.496425
H  3.812398 -2.059984 0.725909
H  -3.814205 2.038696 0.781961
H  2.553475 1.484951 -1.447003
H  -2.551371 -1.435743 -1.499602
H  6.192091 -1.428563 0.400057
H  -6.193599 1.418242 0.431576
H  4.960803 2.124375 -1.788464
H  -4.958242 -2.064093 -1.865482
