program: Gaussian 09
title: 000225170
version: EM64L-G09RevD.01
frameworkgroup: C1[X(C9H13N5O2)]
method: RPBEPBE
basis: SDD
operation: Freq
keyword: #p
keyword: freq=noraman
keyword: PBEPBE/SDD
title: #p freq=noraman PBEPBE/SDD
converged: YES YES NO NO
title: Mulliken charges:
elementType: O O N N N N N C C C C C C C C C H H H H H H H H H H H H H
charge: -0.302950 -0.277264 -0.215635 -0.158104 -0.221377 -0.113676 -0.617321 0.167782 0.108429 -0.386559 0.168614 0.142405 0.203226 -0.617096 -0.657605 -0.603277 0.204351 0.289653 0.271133 0.243711 0.244112 0.252265 0.226536 0.209417 0.267429 0.246975 0.246995 0.333587 0.344245
chargesum: 0.00000
title: Mulliken charges with hydrogens summed into heavy atoms:
elementType: O O N N N N N C C C C C C C C C
charge: -0.302950 -0.277264 -0.215635 -0.158104 -0.221377 -0.113676 0.060512 0.167782 0.108429 0.107446 0.168614 0.142405 0.203226 0.141859 0.030613 0.158121
polarizability: 1.89996145e+02 -7.32954358e+00 1.59220612e+02 4.20366903e+00 2.39975838e+00 7.64539810e+01
1716.lowfreq: -10.4988 -8.6676 -0.0006 -0.0005 0.0004 3.8007 31.4937 52.9545 81.7363
frequency: 31.1331 52.9343 81.7351 91.5011 113.3389 117.4789 125.5476 170.9170 176.7889 211.1983 227.1703 240.9303 282.8642 298.8195 315.2642 325.1459 350.9016 382.0980 397.3370 411.4952 433.1540 455.4422 495.4988 523.2498 622.1537 646.8757 697.5179 699.9968 704.6685 728.8661 757.8518 777.4270 805.7077 946.3080 957.4992 978.5199 1017.6750 1038.0873 1059.6877 1085.5786 1129.4238 1132.1827 1174.2350 1194.7459 1223.1806 1227.6256 1268.1290 1278.3075 1310.8003 1355.3413 1385.8429 1393.1129 1409.3115 1426.0693 1435.5977 1461.7970 1466.9957 1473.9328 1477.5844 1478.4467 1479.1734 1486.1229 1502.8670 1543.1723 1580.4471 1608.9634 1646.2488 1652.2479 2988.6558 2992.0841 3005.5546 3009.1740 3071.4640 3090.2767 3094.0268 3099.9905 3102.9028 3134.8600 3137.2714 3577.9782 3723.8402
redmass: 2.5268 3.8180 3.1468 1.1067 1.4082 2.8320 3.4665 2.7621 1.6955 2.0418 1.2313 7.0881 2.3260 2.8444 4.6141 4.4600 3.8741 8.9750 5.3720 5.7660 1.5166 2.3749 5.3824 7.0948 3.7818 8.6872 10.6133 6.5178 10.9389 11.0304 3.2305 2.7464 1.7421 3.2142 3.1087 2.6472 2.3365 2.7455 2.3960 2.0351 1.3018 1.2980 2.1415 3.6744 4.0149 3.0192 6.0250 2.2704 2.2846 1.4800 2.7464 1.2252 1.3734 1.3799 2.4357 1.5384 1.0772 1.0453 1.0878 1.0430 1.1296 1.1027 2.2377 3.8681 2.4126 4.2160 3.0718 9.1364 1.0378 1.0649 1.0335 1.0327 1.0985 1.0988 1.1024 1.1021 1.1012 1.1022 1.1011 1.0451 1.1050
irintensity: 0.0813 0.0630 0.9783 0.1445 1.4987 2.6223 0.0611 17.8157 9.2722 6.7437 113.9938 1.4732 2.0796 6.4147 5.6086 8.4784 9.2962 13.7952 21.5879 17.3950 121.7684 36.7101 23.5928 1.8492 1.7279 3.5942 0.5655 12.2926 8.3830 20.2847 0.5142 0.5462 12.8434 1.0326 53.4319 14.3687 9.3895 54.9243 8.5457 8.2706 0.3187 0.1811 1.1029 71.3220 37.4098 5.8615 59.8862 21.7205 16.0802 35.2527 24.7461 28.4462 6.0099 57.7040 152.5721 110.4938 44.8486 16.5637 33.0005 16.2915 26.8204 75.0486 114.4082 165.5165 17.6188 694.9351 438.9645 319.1153 22.5834 47.4023 39.7314 32.4116 10.4221 24.5847 19.5855 19.6553 19.0084 0.7329 0.4854 132.2294 47.3008
temp: 298.150 k
press: 1.00000 atm
elementType: 8 8 7 7 7 7 7 6 6 6 6 6 6 6 6 6 1 1 1 1 1 1 1 1 1 1 1 1 1
symmnumber: 1
zpe: 598529.7 jmol-1
zpe.correction: 0.227968 hartree
zpe.thermalcorrener: 0.244293 hartree
zpe.thermalcorrenthalpy: 0.245237 hartree
zpe.thermalcorrgfe: 0.184072 hartree
zpe.sumelectzpe: -773.821191 hartree
zpe.sumelectthermal: -773.804866 hartree
zpe.sumelectthermalent: -773.803922 hartree
zpe.sumelectthermalfe: -773.865087 hartree
dipole: -6.4902 1.8093 -0.0888
dipole: 6.7383
quadrupole: -81.8514 -95.4986 -94.7378
quadrupole: -4.7449 0.6700 -1.2640
quadrupole: 8.8446 -4.8026 -4.0419 -4.7449 0.6700 -1.2640
hfenergy: -774.0491586 hartree
pointgroup: C01 [X(C9H13N5O2)]
dipole: -2.5655306 0.6678058 0.0096555 debye
polarizability: 190.3367313|-6.7845071|158.9166222|2.415987|3.416106|76.4173846 unknown
InChI: InChI=1S/C9H13N5O2/c1-4-14-5-6(11-8(14)10)12(2)9(16)13(3)7(5)15/h4,10H2,1-3H3
charge 0 multiplicity 1
29 atoms
O  0.130028 -2.660542 -0.321764
O  3.625535 0.479761 0.152988
N  -1.792674 -0.187897 -0.229213
N  1.430828 1.31248 0.090577
N  1.867974 -1.055789 -0.074808
N  -0.955785 1.943307 -0.001951
N  -3.349712 1.684496 -0.170016
C  -0.381394 -0.297088 -0.14078
C  0.079837 1.021743 -0.010622
C  -2.748965 -1.310188 -0.319943
C  0.477676 -1.43934 -0.191826
C  -2.076158 1.167555 -0.130634
C  2.38184 0.261142 0.062251
C  1.889027 2.707794 0.225015
C  -3.349658 -1.692793 1.049435
C  2.881931 -2.133485 -0.106834
H  -3.541333 -1.039182 -1.045145
H  -2.190422 -2.166966 -0.731329
H  2.987444 2.691894 0.27521
H  1.471324 3.157711 1.141458
H  1.553919 3.301147 -0.642242
H  -2.55157 -2.026994 1.733595
H  -4.064519 -2.525988 0.926045
H  -3.881089 -0.847784 1.524121
H  2.340516 -3.085503 -0.208787
H  3.477093 -2.121867 0.821006
H  3.567378 -1.985435 -0.957592
H  -4.175167 1.097777 -0.231104
H  -3.447803 2.694337 -0.121213
