program: Gaussian 09
title: 000225199
version: EM64L-G09RevD.01
frameworkgroup: C1[X(C16H16O4)]
method: RPBEPBE
basis: SDD
operation: Freq
keyword: #pfreq=noraman
keyword: PBEPBE/SDD
title: #p freq=noraman PBEPBE/SDD
converged: YES YES NO NO
title: Mulliken charges:
elementType: O O O O C C C C C C C C C C C C C C C C H H H H H H H H H H H H H H H H
charge: -0.476006 -0.493846 -0.270917 -0.266612 -0.322241 -0.230225 0.562475 0.505542 -0.365444 -0.509445 -0.421826 0.209132 -0.432162 -0.408472 0.157973 -0.338479 -0.218572 -0.242685 -0.205267 -0.242056 0.260717 0.193682 0.233407 0.205503 0.288972 0.232482 0.237156 0.228042 0.246516 0.369117 0.227106 0.225247 0.236371 0.228660 0.366846 0.229310
chargesum: 0.00000
title: Mulliken charges with hydrogens summed into heavy atoms:
elementType: O O O O C C C C C C C C C C C C C C C C
charge: -0.106889 -0.127000 -0.270917 -0.266612 -0.061525 -0.036544 0.562475 0.505542 0.073466 -0.220472 -0.189345 0.209132 -0.195006 -0.180430 0.157973 -0.091962 0.008535 -0.017438 0.259763 -0.012746
polarizability: 2.04459792e+02 6.91178969e+00 1.90551408e+02 -2.77890826e+01 1.08701158e+01 1.39509330e+02
1716.lowfreq: -9.5959 -4.5451 0.0004 0.0007 0.0009 7.2933 17.5519 28.5600 37.1824
frequency: 17.1277 28.3612 37.1548 54.2926 82.2843 96.4888 101.6298 155.0263 178.7874 201.5897 223.6124 225.1906 285.7620 289.8474 321.1499 339.5363 378.9089 397.6501 403.0105 412.3924 442.4611 477.0815 529.8992 551.8565 602.6408 615.4301 619.1556 630.6975 649.7305 676.0424 703.7885 721.4258 758.1692 767.0334 783.0834 807.8475 837.1465 843.1103 850.0051 864.7031 898.6507 911.7646 921.9297 929.0935 956.3919 972.8866 976.5727 989.9496 994.4242 1002.0534 1025.8256 1035.4461 1052.8332 1059.1200 1073.1574 1085.8381 1125.7117 1129.8007 1170.0704 1172.7341 1186.6684 1190.5913 1195.0283 1201.3667 1242.4049 1249.0977 1256.2031 1278.4769 1296.7967 1320.5240 1334.8151 1362.8885 1382.2004 1389.3597 1402.7515 1434.2831 1441.1864 1445.1894 1469.7826 1479.0969 1483.8543 1485.5271 1591.9477 1611.7451 1613.6758 1630.7761 2912.0265 2960.2418 2990.3641 3005.6401 3033.6380 3102.8873 3113.6715 3122.2977 3133.9697 3141.5624 3144.9930 3163.2118 3178.9685 3187.0299 3301.6015 3595.8547
redmass: 5.6522 4.3238 5.6840 5.1799 3.5432 3.1019 3.1761 6.4525 6.0107 4.9309 4.5087 4.2852 1.3860 3.3645 4.1978 6.3233 6.1044 4.1316 2.8111 3.7284 3.4950 4.0930 3.3398 5.4183 4.9260 6.0790 4.7179 5.5409 1.1733 8.9106 1.6878 4.1659 4.8734 2.0413 5.2751 1.4328 6.6982 4.3549 1.2549 2.1106 1.5360 1.4889 3.1337 1.3869 5.8906 1.3929 5.2429 6.0483 1.3287 5.6343 2.4142 2.3562 2.8985 2.6738 1.4988 1.6585 1.3130 1.1572 1.6617 1.0620 1.1938 1.1213 1.4021 1.4581 3.6970 1.4361 1.6868 1.3117 1.3531 1.2216 1.2723 1.2601 7.4342 1.3449 3.5762 2.1892 2.1871 1.9245 1.2056 1.7549 2.2739 1.4015 5.9921 7.9191 6.2055 8.3310 1.0832 1.0581 1.0618 1.0845 1.1056 1.1090 1.0866 1.0865 1.0913 1.0895 1.0959 1.1015 1.0955 1.0928 1.0671 1.0668
irintensity: 0.3501 0.2573 1.9318 2.8335 5.0371 9.5036 2.7218 4.9795 2.8347 7.5517 0.7700 2.4610 74.5287 24.3546 15.8712 8.8613 6.1331 16.5294 0.2341 4.4563 1.0211 4.6885 22.0679 11.8966 6.1239 2.4433 4.4760 8.9679 131.0157 0.3735 58.7540 8.2175 15.3225 31.9258 12.4845 59.3118 44.1422 10.2145 0.3932 4.1016 17.1794 1.8244 5.4158 0.6353 44.5193 0.1018 152.1060 1.8055 0.4733 59.1966 3.9552 31.9399 7.9358 36.7100 7.6930 9.3888 6.0241 3.3440 18.1065 0.2555 13.1795 0.7937 1.3185 16.5489 155.7979 57.5532 8.7294 1.0671 40.5343 0.6941 3.2145 2.4215 0.1178 14.7274 34.6787 29.2711 13.1917 192.1642 59.0239 25.0163 12.8095 24.2335 1.8674 5.3080 4.1736 0.5579 43.2093 46.2618 143.2731 12.2845 41.3695 33.0210 10.2286 2.1703 12.2769 8.9171 38.8863 21.2967 5.2357 1.8566 321.6502 7.9806
temp: 298.150 k
press: 1.00000 atm
elementType: 8 8 8 8 6 6 6 6 6 6 6 6 6 6 6 6 6 6 6 6 1 1 1 1 1 1 1 1 1 1 1 1 1 1 1 1
symmnumber: 1
zpe: 744732.6 jmol-1
zpe.correction: 0.283654 hartree
zpe.thermalcorrener: 0.301444 hartree
zpe.thermalcorrenthalpy: 0.302388 hartree
zpe.thermalcorrgfe: 0.235698 hartree
zpe.sumelectzpe: -918.702186 hartree
zpe.sumelectthermal: -918.684396 hartree
zpe.sumelectthermalent: -918.683451 hartree
zpe.sumelectthermalfe: -918.750141 hartree
dipole: -4.0361 1.0829 -0.4071
dipole: 4.1986
quadrupole: -93.2990 -115.4312 -114.2798
quadrupole: 9.5683 -5.7222 2.0314
quadrupole: 14.3710 -7.7612 -6.6098 9.5683 -5.7222 2.0314
hfenergy: -918.9858394 hartree
pointgroup: C01 [X(C16H16O4)]
dipole: -1.614731 0.3059065 0.1663808 debye
polarizability: 191.5079253|13.5682855|189.2190505|-36.5228304|11.9416644|153.7935541 unknown
InChI: InChI=1S/C16H16O4/c17-9-13(11-4-2-1-3-5-11)16(18)12-6-7-14-15(8-12)20-10-19-14/h1-8,13,16-18H,9-10H2
charge 0 multiplicity 1
36 atoms
O  -0.270354 -3.089297 0.298565
O  -2.787986 -3.406346 -0.461837
O  3.610297 -0.452786 -1.883216
O  4.134972 1.359539 -0.402178
C  -1.790719 -1.176617 -0.213483
C  -0.584884 -1.705394 0.655673
C  0.677836 -0.874877 0.449435
C  -2.116916 0.289587 0.060854
C  -3.068869 -2.022731 -0.004796
C  1.518153 -1.174817 -0.66187
C  0.999641 0.189837 1.324674
C  2.643301 -0.372481 -0.841689
C  -1.909595 1.269124 -0.94225
C  -2.630275 0.708573 1.317797
C  2.954659 0.694383 0.02843
C  2.149973 1.002679 1.126394
C  -2.203841 2.629852 -0.701892
C  -2.927544 2.067952 1.56169
C  4.676535 0.502231 -1.489667
C  -2.716026 3.034909 0.552021
H  -1.489667 -1.288953 -1.27365
H  -0.890491 -1.645434 1.725864
H  -3.898996 -1.592766 -0.597998
H  -3.359747 -2.035967 1.066223
H  1.293536 -2.029095 -1.304036
H  0.347223 0.398773 2.179391
H  -1.501379 0.963607 -1.913111
H  -2.793318 -0.02347 2.118612
H  2.396335 1.825957 1.801464
H  -1.125216 -3.538814 0.023402
H  -2.030106 3.371812 -1.48936
H  -3.320879 2.373108 2.538222
H  4.928005 1.136251 -2.353854
H  5.544994 -0.064586 -1.101643
H  -3.575772 -3.986678 -0.327187
H  -2.944583 4.089734 0.740908
