program: Gaussian 09
title: 000225168
version: EM64L-G09RevD.01
frameworkgroup: C1[X(C9H7BrN2O)]
method: RPBEPBE
basis: SDD
operation: Freq
keyword: #p
keyword: freq=noraman
keyword: PBEPBE/SDD
title: #p freq=noraman PBEPBE/SDD
converged: NO NO NO NO
title: Mulliken charges:
elementType: Br O N N C C C C C C C C C H H H H H H H
charge: 0.025780 -0.216605 -0.429525 0.005598 0.414044 0.069564 0.120332 -0.391118 -0.256322 -0.037777 -0.141337 -0.257063 -0.775584 0.318853 0.238838 0.296234 0.256221 0.289226 0.235344 0.235297
chargesum: 0.00000
title: Mulliken charges with hydrogens summed into heavy atoms:
elementType: Br O N N C C C C C C C C C
charge: 0.025780 -0.216605 -0.110671 0.005598 0.414044 0.069564 0.120332 -0.152280 0.039912 -0.037777 0.114884 -0.257063 -0.015717
polarizability: 2.09667762e+02 4.47747211e+00 1.37260548e+02 -7.86404574e-04 -5.42337151e-04 5.25255405e+01
1716.lowfreq: -0.0005 -0.0001 0.0007 4.2926 5.5323 12.4383 46.0701 51.2710 130.5302
frequency: 45.9102 51.2681 130.5288 135.8121 157.9556 195.4656 231.8904 303.2295 329.7444 335.2793 430.8691 474.6781 485.7993 536.2636 561.0241 587.3898 607.4327 629.6127 660.1195 689.3358 770.0570 789.2230 820.5041 854.5168 937.2203 956.7694 957.2601 988.5129 1047.1529 1058.5426 1075.7371 1126.7101 1182.3649 1239.7775 1278.0773 1280.1421 1363.0876 1390.6902 1397.4002 1436.6320 1460.0133 1470.0190 1472.9053 1560.3700 1590.4351 1603.3749 1615.6176 2986.0516 3064.6780 3132.8227 3145.6562 3169.2334 3173.2696 3536.3730
redmass: 1.0435 5.4504 6.8837 9.8641 4.5851 4.9429 7.8019 3.8191 6.1353 5.2492 3.4559 5.9454 7.3275 3.7118 7.7021 5.9150 3.8035 1.1860 6.4351 5.0223 7.3696 4.1523 1.6399 4.8078 1.4016 5.4719 1.3659 2.0533 1.5674 2.0546 3.8233 2.0095 2.0819 1.5654 2.1305 2.5242 3.6160 1.3856 4.6750 1.6994 2.5011 1.0448 1.8012 5.7274 8.1812 6.6460 6.5421 1.0397 1.0979 1.0904 1.0967 1.0926 1.0958 1.0781
irintensity: 0.1915 0.4123 0.0619 2.1596 0.4488 3.1748 3.1032 1.3703 6.2248 0.0605 1.5073 1.0358 6.6869 34.6810 0.0851 6.4804 4.1697 75.2245 7.2878 0.0619 35.7788 0.3421 64.0873 19.4428 6.4783 2.2514 4.1161 4.4691 5.9017 10.7023 1.3049 52.8834 34.1355 25.4652 62.7652 2.7417 58.6198 46.6855 3.5837 150.4593 118.1838 20.9873 53.6834 353.1262 81.3709 91.3489 51.2905 13.7201 14.1532 7.9613 2.0792 3.3291 5.3420 36.1903
temp: 298.150 k
press: 1.00000 atm
elementType: 35 8 7 7 6 6 6 6 6 6 6 6 6 1 1 1 1 1 1 1
symmnumber: 1
zpe: 373897.6 jmol-1
zpe.correction: 0.142410 hartree
zpe.thermalcorrener: 0.153712 hartree
zpe.thermalcorrenthalpy: 0.154656 hartree
zpe.thermalcorrgfe: 0.103355 hartree
zpe.sumelectzpe: -544.453083 hartree
zpe.sumelectthermal: -544.441781 hartree
zpe.sumelectthermalent: -544.440837 hartree
zpe.sumelectthermalfe: -544.492139 hartree
dipole: -2.0946 -8.1362 0.0001
dipole: 8.4015
quadrupole: -75.2369 -87.2630 -86.4250
quadrupole: 18.6511 -0.0002 0.0002
quadrupole: 7.7381 -4.2880 -3.4501 18.6511 -0.0002 0.0002
hfenergy: -544.5954931 hartree
pointgroup: C01 [X(C9H7Br1N2O1)]
dipole: 0.5486996 3.2595395 -0.0102796 debye
dipolederiv: -0.7867889 -0.1407555 0.0003626 -0.2190818 -0.0877256 0.0001482 0.0006317 0.0002206 -0.022869 -0.4876621 -0.1290518 0.0003948 0.1196407 -1.1638014 0.0025815 -0.0003947 0.0025526 -0.3573254 -1.325772 0.1358267 -0.0005974 0.1482671 -0.5934326 0.0011644 -0.000625 0.0011807 -0.2289666 -0.7791516 -0.5604753 0.0017022 -0.1284557 -0.9899339 0.0022503 0.0003574 0.0022652 -0.2694533 0.8561031 0.1799871 -0.0004739 0.1961215 0.0399056 0.0001452 -0.0005827 0.0001051 0.0812275 -0.3630457 0.290649 -0.0009521 0.159431 -0.2936415 0.0009921 -0.0005642 0.000973 0.0067484 1.1288276 -0.1214055 0.0005686 -0.2084962 1.2196565 -0.0036388 0.0009523 -0.0035993 0.074843 -0.2179658 -0.0966691 0.0003013 0.0425365 0.1058605 -0.0009215 -0.0001132 -0.0009017 -0.1866783 -0.336081 -0.1926149 0.0005466 0.0341923 0.0376498 -0.0002217 -0.0001406 -0.0002762 -0.0348466 1.0164206 0.2764285 -0.0007779 -0.2267329 1.4870519 -0.0040269 0.0007989 -0.0039961 0.2283271 -0.2507184 -0.0434712 0.0000967 -0.1459732 0.1406507 -0.0006222 0.0004589 -0.0006571 -0.066953 1.3279625 0.4061605 -0.0011151 0.4444058 -0.1016997 -0.0001383 -0.0012616 -0.0001296 -0.156242 -0.3047635 -0.0654535 0.0001624 -0.1947023 -0.0629335 0.000284 0.0003667 0.000198 0.0481011 0.1832109 0.046545 -0.000157 0.0047562 0.1456408 0.0005808 -0.0000201 0.000581 0.3204806 0.0330099 -0.0870448 0.0002608 -0.0428335 -0.0734628 0.0007854 0.0001088 0.0007619 0.1745919 0.1361816 0.014126 -0.0000502 -0.0702104 0.0585806 0.0002968 0.000221 0.0003079 0.1539109 0.0189136 0.079661 -0.0002402 0.0707817 0.0471134 0.0003344 -0.0002469 0.0003597 0.1573903 0.0620333 0.0311948 -0.0000698 0.119481 0.0254188 0.0002909 -0.0002936 0.0003326 0.1343393 0.0446368 -0.011793 0.0145741 -0.0516795 0.0289416 -0.1083922 -0.0398763 -0.111511 -0.0276931 0.0446494 -0.011844 -0.0145364 -0.0514482 0.0301609 0.1081074 0.0402232 0.1112326 -0.0289328 unknown
polarizability: 208.3842276|10.5516575|138.5432214|-0.0135653|-0.2717836|52.5264017 unknown
InChI: InChI=1S/C9H7BrN2O/c1-5-11-8-3-2-6(10)4-7(8)9(13)12-5/h2-4,11H,1H3
charge 0 multiplicity 1
20 atoms
Br -4.432732 -0.554632 0.001945
O  0.729467 -2.706129 0.009394
N  1.447184 1.317974 -0.003335
N  2.270876 -0.935947 0.003978
C  0.098527 0.929754 -0.002253
C  -0.183147 -0.467063 0.002152
C  2.475003 0.371939 -0.000179
C  -0.956605 1.877821 -0.00539
C  -1.531087 -0.906275 0.003398
C  0.938387 -1.460564 0.005462
C  -2.289965 1.433064 -0.004141
C  -2.563338 0.040998 0.000255
C  3.882556 0.923908 -0.001684
H  1.683774 2.31215 -0.006509
H  -0.741425 2.952692 -0.008784
H  -1.716863 -1.984526 0.006841
H  -3.111047 2.155386 -0.006544
H  4.586312 0.081033 0.00068
H  4.071038 1.54902 0.89154
H  4.071088 1.544094 -0.898325
