program: Gaussian 09
title: 000225167
version: EM64L-G09RevD.01
frameworkgroup: C1[X(C8H14O3)]
method: RPBEPBE
basis: SDD
operation: Freq
keyword: #pfreq=noraman
keyword: PBEPBE/SDD
title: #p freq=noraman PBEPBE/SDD
converged: YES YES NO NO
title: Mulliken charges:
elementType: O O O C C C C C C C C H H H H H H H H H H H H H H
charge: -0.468099 -0.417721 -0.241745 -0.005047 -0.085581 -0.456737 -0.445532 -0.405367 -0.392646 -0.557620 0.171768 0.243515 0.177121 0.237953 0.187993 0.183744 0.217719 0.202382 0.202056 0.193266 0.205306 0.239041 0.304629 0.336517 0.373084
chargesum: 0.00000
title: Mulliken charges with hydrogens summed into heavy atoms:
elementType: O O O C C C C C C C C
charge: -0.131582 -0.044637 -0.241745 0.238467 0.091540 -0.030791 -0.044069 -0.000928 0.005926 -0.013950 0.171768
polarizability: 1.09098783e+02 -1.65719412e+00 9.09148910e+01 -1.72117094e+00 -3.56202573e+00 7.73770749e+01
1716.lowfreq: -15.8603 -1.2040 -0.0009 -0.0006 -0.0003 17.1972 37.9278 67.0563 91.5891
frequency: 37.7598 66.9148 91.5416 139.1530 184.7296 232.1595 279.8857 305.6798 313.6024 357.3945 396.1725 416.6255 440.7581 503.5347 523.2491 556.4961 598.0400 643.4144 785.4432 820.0527 828.5853 870.3301 880.5277 901.2993 927.7417 963.4354 1008.7622 1039.3992 1051.8612 1061.4275 1091.6590 1099.6371 1114.5203 1141.4138 1159.2628 1196.4348 1232.0268 1247.4991 1247.8928 1262.5474 1297.7046 1300.4071 1315.8568 1331.7765 1339.7565 1343.8167 1348.8640 1366.2972 1397.1605 1437.3358 1463.2810 1463.5871 1469.5666 1476.0038 1662.6395 2909.6577 2958.2844 2963.7762 2971.6310 2976.3356 2990.9115 3001.8173 3026.9828 3035.2948 3042.6847 3047.1001 3051.5499 3509.8424 3564.8094
redmass: 8.9359 3.6328 3.8317 3.8620 2.3117 4.8983 1.0948 3.5059 1.7139 2.3689 3.8936 3.7050 2.9643 1.9284 3.1560 2.0455 3.7904 1.4044 1.9690 1.9623 2.1753 2.9323 2.1307 1.8669 1.8525 2.0402 4.0532 2.1684 1.4709 1.6778 2.1153 1.6179 2.1221 1.7913 1.5077 1.3393 1.3294 1.3086 1.3446 1.3651 1.4472 1.2725 1.2215 1.3756 1.4663 1.4888 1.5163 1.7287 1.6947 1.0915 1.0948 1.0908 1.0827 1.0970 8.0075 1.0828 1.0666 1.0607 1.0644 1.0617 1.0625 1.0808 1.0991 1.0977 1.0982 1.0994 1.0994 1.0638 1.0661
irintensity: 1.0458 0.1429 1.3557 2.2801 2.1657 4.0922 132.4060 0.8233 0.6719 9.5244 22.2871 3.0306 3.8624 28.4241 17.6749 26.3493 7.4754 127.7872 1.5163 4.7757 8.8705 5.2481 14.4777 2.6685 36.5431 23.6690 72.2101 227.0140 6.2569 47.5844 4.8789 4.2825 0.9835 24.4060 19.4644 1.5116 11.1846 3.9947 1.6780 9.7431 21.0684 14.0429 14.7289 2.6920 1.1811 2.9446 10.5421 54.8938 0.7870 36.2239 5.6349 8.0194 18.3479 4.4698 191.5821 46.3906 29.9837 35.0770 46.4515 32.1332 8.7326 29.5797 38.7150 50.2697 40.1684 4.2731 84.3149 18.4213 2.7704
temp: 298.150 k
press: 1.00000 atm
elementType: 8 8 8 6 6 6 6 6 6 6 6 1 1 1 1 1 1 1 1 1 1 1 1 1 1
symmnumber: 1
zpe: 556763.6 jmol-1
zpe.correction: 0.212060 hartree
zpe.thermalcorrener: 0.223392 hartree
zpe.thermalcorrenthalpy: 0.224337 hartree
zpe.thermalcorrgfe: 0.174456 hartree
zpe.sumelectzpe: -538.048315 hartree
zpe.sumelectthermal: -538.036983 hartree
zpe.sumelectthermalent: -538.036038 hartree
zpe.sumelectthermalfe: -538.085919 hartree
dipole: -2.0591 0.4020 -1.7788
dipole: 2.7505
quadrupole: -57.8239 -66.4862 -70.2445
quadrupole: -3.5267 -0.9507 0.9157
quadrupole: 7.0277 -1.6347 -5.3930 -3.5267 -0.9507 0.9157
hfenergy: -538.260375 hartree
pointgroup: C01 [X(C8H14O3)]
dipole: -0.8138365 0.0935594 -0.7070678 debye
dipolederiv: -0.3290513 -0.1644692 0.1229941 -0.1443419 -0.8833069 -0.0884279 0.1479536 -0.1199304 -0.4936691 -1.1385192 -0.250101 0.4405333 -0.1782462 -0.4070797 0.01201 0.4257585 0.0274842 -0.5272551 -0.7043963 0.0807165 -0.0934328 -0.0743192 -0.5311153 0.316649 0.1131826 0.2945561 -0.7398981 0.086026 0.0467836 0.0213073 0.003017 0.0010617 0.0006198 -0.0117385 0.0429135 0.0710984 0.2825944 0.0318517 -0.0326233 0.0212137 0.6752178 0.087719 -0.0244804 0.0388635 0.4175374 -0.0267751 0.0167535 0.0212285 -0.0231496 0.0426812 0.0039425 0.024372 0.0214828 0.1637831 -0.0161606 -0.136961 0.0366321 -0.0349628 -0.0588162 -0.0367287 0.0226303 -0.0190664 0.090212 0.0529786 -0.0092898 0.0085856 -0.0157911 0.0630849 0.0147468 -0.0139452 -0.0257053 0.1419484 0.0612485 0.0056125 -0.0150614 0.0279715 0.0588184 -0.0043482 0.0330583 0.0280768 0.1607643 -0.254178 0.0743905 -0.0593568 0.2471944 -0.1320878 0.1339636 -0.143273 0.1080961 0.050452 1.6010969 0.0095396 -0.2158679 -0.0041943 0.5611809 -0.512972 -0.3191443 -0.5002828 0.9299625 0.0757401 0.0077177 0.0138798 -0.0252703 0.0508224 0.0074341 0.0134511 -0.0113789 -0.1123588 -0.0001154 -0.0138614 -0.0029895 -0.0029543 -0.0292369 -0.0217062 -0.0132604 -0.0197877 -0.2417527 -0.0751488 0.1157077 -0.0173503 0.115389 -0.0095759 0.0083391 -0.0249152 0.0358987 0.0659257 0.0560602 -0.03596 -0.0086531 -0.0291651 0.0400164 0.0441711 0.0205987 -0.0214665 -0.1887825 -0.1230928 0.1228098 -0.0263696 0.1481701 -0.0975817 0.0271309 -0.0484376 0.0617383 0.0608448 0.0610098 -0.0222575 -0.044479 -0.0207651 0.0569123 0.0063042 0.0193307 -0.0172351 -0.1526855 0.0216668 0.0144049 -0.0178608 0.0157818 0.0840158 -0.0085094 0.0011648 0.0613967 -0.1754412 0.0168918 -0.041937 -0.0081508 -0.0527333 -0.2029102 -0.0644306 -0.0157769 -0.0988392 0.0543128 0.0751867 0.0242145 -0.0008302 0.0262887 0.027289 0.0154584 -0.0748454 -0.015271 -0.1925247 -0.1791968 -0.0893721 0.0658018 -0.087145 0.0000434 0.0207996 0.0991966 0.0336417 0.0513065 0.0402727 0.006942 -0.0157852 -0.0069313 0.1183873 -0.0428995 0.0327097 -0.0010877 -0.0910655 0.1288246 -0.0525773 -0.0216269 -0.1148172 0.0156825 -0.021233 -0.040807 -0.0240581 0.101291 0.0499554 0.1924072 -0.0808913 0.0982334 0.2615748 -0.0038379 -0.1090634 0.0087351 0.31143 0.2370819 0.0669345 -0.0696339 0.1115272 0.2949218 0.1058051 -0.1137196 0.1112257 0.2445642 unknown
polarizability: 109.244687|-0.6216733|90.5895005|-1.3184292|-3.9961345|77.5565618 unknown
InChI: InChI=1S/C8H14O3/c9-7-4-2-1-3-6(7)5-8(10)11/h6-7,9-10H,1-5H2
charge 0 multiplicity 1
25 atoms
O  -0.948597 2.344383 0.264189
O  3.635883 0.370649 -0.607312
O  2.55234 -0.702641 1.138797
C  -0.066432 0.09734 0.084136
C  -1.253752 1.007366 -0.289641
C  -0.328309 -1.345096 -0.423892
C  -2.586158 0.458941 0.260208
C  -1.665083 -1.910468 0.109553
C  -2.849317 -0.980793 -0.245235
C  1.252693 0.683404 -0.459341
C  2.485468 0.031467 0.126939
H  -0.003172 0.074774 1.190788
H  -1.325433 1.073735 -1.401628
H  0.509811 -1.995353 -0.112896
H  -0.34705 -1.343923 -1.534912
H  -3.420454 1.127997 -0.037033
H  -2.53598 0.468005 1.367365
H  -1.600352 -2.018392 1.211349
H  -1.838784 -2.922902 -0.302919
H  -2.987094 -0.967154 -1.346589
H  -3.791121 -1.366187 0.189526
H  1.308531 0.611591 -1.562532
H  1.295281 1.76335 -0.216221
H  -1.72017 2.943552 0.101404
H  4.42925 -0.045244 -0.171704
