program: Gaussian 09
title: 000225166
version: EM64L-G09RevD.01
frameworkgroup: C1[X(C8H8BrNO2)]
method: RPBEPBE
basis: SDD
operation: Freq
keyword: #p
keyword: freq=noraman
keyword: PBEPBE/SDD
title: #p freq=noraman PBEPBE/SDD
converged: YES YES NO NO
title: Mulliken charges:
elementType: Br O O N C C C C C C C C H H H H H H H H
charge: 0.035675 -0.413522 -0.259984 -0.445578 0.514604 -0.430295 -0.332166 -0.361704 -0.345475 0.419935 0.213927 -0.798594 0.242048 0.314040 0.313627 0.226131 0.237759 0.270131 0.237698 0.361744
chargesum: 0.00000
title: Mulliken charges with hydrogens summed into heavy atoms:
elementType: Br O O N C C C C C C C C
charge: 0.035675 -0.051778 -0.259984 -0.131951 0.514604 -0.188247 -0.018127 -0.361704 -0.119344 0.419935 0.213927 -0.053007
polarizability: 1.89842251e+02 -1.51873991e-01 1.25019503e+02 2.93278707e-03 3.77343751e-04 4.90270083e+01
1716.lowfreq: -82.3977 -7.6968 -2.7808 -0.0011 -0.0009 -0.0008 4.2768 52.3885 71.6257
frequency: -82.3964 52.3644 71.5866 117.1947 137.0842 186.8245 196.0435 231.0509 308.2424 341.9417 355.2448 366.0832 432.6607 465.6916 493.5137 567.4626 591.7534 622.1604 635.1956 680.5066 708.1628 774.8389 816.7060 855.1703 868.3220 939.6616 963.9293 987.8366 1020.0847 1029.3933 1116.7997 1162.4694 1217.1528 1241.6206 1262.7548 1308.7091 1361.1567 1373.4915 1403.8806 1448.6968 1467.3384 1496.4941 1509.9676 1585.1764 1623.6137 1632.1477 2987.2595 3072.4963 3120.8291 3137.2801 3139.8721 3199.6386 3526.0625 3582.0160
redmass: 1.0530 7.8632 3.9269 6.0753 4.9950 7.7851 4.9836 13.3482 3.8649 1.1059 8.3190 5.6064 3.1001 4.3004 4.5682 3.3637 2.8970 6.1404 1.2643 7.1589 3.4273 5.3870 1.4338 5.3589 1.5683 6.4734 1.3098 1.6977 3.0128 1.6612 1.5022 1.1711 3.0646 1.6772 1.9523 2.0326 3.8111 1.2572 5.6026 1.1224 1.0469 3.1082 2.0425 5.5364 7.3103 4.8989 1.0383 1.0984 1.0908 1.0978 1.0921 1.0946 1.0766 1.0661
irintensity: 0.0244 8.8514 3.6987 4.1702 3.6661 9.3282 4.3068 1.2658 1.2930 137.6395 0.4787 0.2170 11.0436 7.8178 25.8835 14.1503 16.0905 0.3003 62.8153 16.7749 2.6382 17.7648 42.9844 13.5119 44.8636 5.5967 4.8514 44.9642 22.7443 8.1375 236.9442 46.5637 76.2353 42.9624 57.4651 57.7508 88.1546 52.4999 6.9798 56.9269 20.1236 461.3854 51.5620 104.9041 0.7325 152.2645 8.7590 15.2158 15.3109 7.1626 4.9310 9.3600 13.2763 53.3378
temp: 298.150 k
press: 1.00000 atm
elementType: 35 8 8 7 6 6 6 6 6 6 6 6 1 1 1 1 1 1 1 1
symmnumber: 1
zpe: 381570.7 jmol-1
zpe.correction: 0.145333 hartree
zpe.thermalcorrener: 0.156548 hartree
zpe.thermalcorrenthalpy: 0.157492 hartree
zpe.thermalcorrgfe: 0.106754 hartree
zpe.sumelectzpe: -527.443188 hartree
zpe.sumelectthermal: -527.431973 hartree
zpe.sumelectthermalent: -527.431029 hartree
zpe.sumelectthermalfe: -527.481767 hartree
dipole: 1.3290 -1.4033 -0.0003
dipole: 1.9327
quadrupole: -87.7663 -62.2552 -82.6071
quadrupole: -18.0549 -0.0001 -0.0005
quadrupole: -10.2234 15.2877 -5.0643 -18.0549 -0.0001 -0.0005
hfenergy: -527.588521 hartree
pointgroup: C01 [X(C8H8Br1N1O2)]
dipole: -0.6136891 -0.4489801 -0.0003897 debye
dipolederiv: -0.3883654 0.2541255 0.0008125 0.3704607 -0.2836113 -0.0007983 0.0011267 -0.0008322 -0.0147363 -1.3315211 -0.5697786 -0.000564 -0.5430178 -0.231748 0.0007395 -0.0005689 0.0008818 -0.3991082 -0.7721176 -0.010143 0.0002697 0.6154834 -0.8787512 -0.0014664 0.0015734 -0.0011417 -0.3426738 -1.8916567 0.0736517 0.0012293 0.2203258 -0.3511898 -0.000217 0.0015293 -0.0001391 -0.322595 1.002269 0.1980571 -0.0002452 0.4842615 0.0091832 -0.0004648 0.0003678 -0.0003428 0.0837643 -0.3012678 -0.0445857 0.0000345 0.2693756 -0.0725301 -0.0000375 0.0006882 0.0001589 -0.1413909 -0.1743656 0.1443806 0.0003253 -0.2052923 0.0138991 0.0004735 -0.0003794 0.000214 -0.146998 0.565389 -0.4525999 -0.0014715 -0.9341131 0.4979646 0.0019493 -0.0025556 0.0017436 -0.1375297 -0.1413511 -0.3009127 -0.0006478 0.2021967 0.0853119 0.0004094 0.0004588 0.0007142 -0.1795319 0.9487543 0.7764423 0.0010407 0.6320076 0.0308851 -0.0005641 0.0007376 -0.0006822 0.0923919 1.9468226 -0.0920627 -0.0013738 -0.8625843 1.0979031 0.0024642 -0.0029454 0.0020691 0.1647189 -0.3450826 -0.157511 -0.0000139 -0.2969252 -0.1705058 -0.0003353 -0.0003537 -0.0006074 0.0588507 0.0780795 -0.0604843 -0.0000668 -0.0603951 -0.0469681 -0.0004148 -0.0000699 -0.0004006 0.1671529 0.1583473 0.0607053 0.000147 0.0361521 0.0960116 -0.0002115 0.0000711 -0.0002052 0.1846474 0.1664181 0.0268962 0.0001447 -0.0200925 0.0941427 -0.000406 0.0000344 -0.0003868 0.3064335 0.0230932 -0.0576956 -0.0000221 -0.0578554 -0.0972691 -0.000519 -0.0000393 -0.0004996 0.1687353 0.0559874 0.0034522 0.0438943 -0.0369743 0.0288927 -0.1010493 -0.0107817 -0.1121764 -0.0315773 -0.0297961 0.0447752 0.0003027 0.1112263 0.0465703 -0.0003445 0.0004946 -0.0001993 0.1319559 0.0559082 0.0039779 -0.0441497 -0.0367514 0.0277222 0.1014706 0.0103375 0.1126053 -0.0304144 0.3744553 0.1593094 0.0003538 0.1125119 0.104087 -0.0006781 0.0002747 -0.0007736 0.3879047 unknown
polarizability: 187.7966597|-11.3327263|127.0646655|-0.1165654|0.1693047|49.0274373 unknown
InChI: InChI=1S/C8H8BrNO2/c1-5(11)10-6-2-3-8(12)7(9)4-6/h2-4,10,12H,1H3
charge 0 multiplicity 1
20 atoms
Br 3.390905 -1.963864 -0.006517
O  3.561533 1.117657 -0.000183
O  -3.105926 1.209455 0.004526
N  -1.7972 -0.740338 -0.000329
C  -0.477167 -0.204174 -0.000149
C  0.603447 -1.126981 -0.002806
C  -0.200867 1.188134 0.002539
C  1.931248 -0.668862 -0.002768
C  1.136457 1.628571 0.002534
C  2.220479 0.717278 -0.000089
C  -3.015351 -0.053058 0.001837
C  -4.237458 -0.972779 0.000863
H  0.412856 -2.206088 -0.004934
H  -1.028546 1.898323 0.004567
H  -1.857796 -1.761379 -0.002283
H  1.341686 2.706976 0.004626
H  -4.253539 -1.618938 -0.896451
H  -5.143291 -0.35031 0.003513
H  -4.251505 -1.623657 0.894794
H  3.632336 2.104631 0.001911
